FailedConsole Output

Skipping 86 KB.. Full Log
 | 1.3/2.2 MB | 283 kB
Progress (3): 592 kB | 1.3/2.2 MB | 283 kB
Progress (3): 592 kB | 1.3/2.2 MB | 283 kB
Progress (3): 592 kB | 1.3/2.2 MB | 283 kB
Progress (3): 592 kB | 1.3/2.2 MB | 283 kB
                                          
Downloaded from central: https://repo.maven.apache.org/maven2/org/apache/httpcomponents/httpcore/4.3.3/httpcore-4.3.3.jar (283 kB at 865 kB/s)
Progress (2): 592 kB | 1.3/2.2 MB
Progress (2): 592 kB | 1.3/2.2 MB
Progress (2): 592 kB | 1.3/2.2 MB
Progress (2): 592 kB | 1.3/2.2 MB
Progress (2): 592 kB | 1.3/2.2 MB
Progress (2): 592 kB | 1.3/2.2 MB
Progress (2): 592 kB | 1.3/2.2 MB
Progress (2): 592 kB | 1.3/2.2 MB
Progress (2): 592 kB | 1.3/2.2 MB
Progress (2): 592 kB | 1.3/2.2 MB
Progress (2): 592 kB | 1.3/2.2 MB
Progress (2): 592 kB | 1.3/2.2 MB
Progress (2): 592 kB | 1.4/2.2 MB
Progress (2): 592 kB | 1.4/2.2 MB
Progress (2): 592 kB | 1.4/2.2 MB
Progress (2): 592 kB | 1.4/2.2 MB
Progress (2): 592 kB | 1.4/2.2 MB
Progress (2): 592 kB | 1.4/2.2 MB
Progress (2): 592 kB | 1.4/2.2 MB
Progress (2): 592 kB | 1.4/2.2 MB
Progress (2): 592 kB | 1.4/2.2 MB
Progress (2): 592 kB | 1.4/2.2 MB
Progress (2): 592 kB | 1.4/2.2 MB
Progress (2): 592 kB | 1.4/2.2 MB
Progress (2): 592 kB | 1.4/2.2 MB
Progress (2): 592 kB | 1.4/2.2 MB
Progress (2): 592 kB | 1.4/2.2 MB
Progress (2): 592 kB | 1.4/2.2 MB
Progress (2): 592 kB | 1.4/2.2 MB
Progress (2): 592 kB | 1.4/2.2 MB
Progress (2): 592 kB | 1.4/2.2 MB
Progress (2): 592 kB | 1.4/2.2 MB
Progress (2): 592 kB | 1.4/2.2 MB
Progress (2): 592 kB | 1.4/2.2 MB
Progress (2): 592 kB | 1.4/2.2 MB
Progress (2): 592 kB | 1.4/2.2 MB
Progress (2): 592 kB | 1.4/2.2 MB
Progress (2): 592 kB | 1.5/2.2 MB
Progress (2): 592 kB | 1.5/2.2 MB
Progress (2): 592 kB | 1.5/2.2 MB
Progress (2): 592 kB | 1.5/2.2 MB
Progress (2): 592 kB | 1.5/2.2 MB
Progress (2): 592 kB | 1.5/2.2 MB
Progress (2): 592 kB | 1.5/2.2 MB
Progress (2): 592 kB | 1.5/2.2 MB
Progress (2): 592 kB | 1.5/2.2 MB
Progress (2): 592 kB | 1.5/2.2 MB
Progress (2): 592 kB | 1.5/2.2 MB
Progress (2): 592 kB | 1.5/2.2 MB
Progress (2): 592 kB | 1.5/2.2 MB
Progress (2): 592 kB | 1.5/2.2 MB
Progress (2): 592 kB | 1.5/2.2 MB
Progress (2): 592 kB | 1.5/2.2 MB
Progress (2): 592 kB | 1.5/2.2 MB
Progress (2): 592 kB | 1.5/2.2 MB
Progress (2): 592 kB | 1.5/2.2 MB
Progress (2): 592 kB | 1.5/2.2 MB
Progress (2): 592 kB | 1.5/2.2 MB
Progress (2): 592 kB | 1.5/2.2 MB
Progress (2): 592 kB | 1.5/2.2 MB
Progress (2): 592 kB | 1.5/2.2 MB
Progress (2): 592 kB | 1.6/2.2 MB
Progress (2): 592 kB | 1.6/2.2 MB
Progress (2): 592 kB | 1.6/2.2 MB
Progress (2): 592 kB | 1.6/2.2 MB
Progress (2): 592 kB | 1.6/2.2 MB
Progress (2): 592 kB | 1.6/2.2 MB
Progress (2): 592 kB | 1.6/2.2 MB
Progress (2): 592 kB | 1.6/2.2 MB
Progress (2): 592 kB | 1.6/2.2 MB
Progress (2): 592 kB | 1.6/2.2 MB
Progress (2): 592 kB | 1.6/2.2 MB
Progress (2): 592 kB | 1.6/2.2 MB
Progress (2): 592 kB | 1.6/2.2 MB
Progress (2): 592 kB | 1.6/2.2 MB
Progress (2): 592 kB | 1.6/2.2 MB
Progress (2): 592 kB | 1.6/2.2 MB
Progress (2): 592 kB | 1.6/2.2 MB
Progress (2): 592 kB | 1.6/2.2 MB
Progress (2): 592 kB | 1.6/2.2 MB
Progress (2): 592 kB | 1.6/2.2 MB
Progress (2): 592 kB | 1.6/2.2 MB
Progress (2): 592 kB | 1.6/2.2 MB
Progress (2): 592 kB | 1.6/2.2 MB
Progress (2): 592 kB | 1.6/2.2 MB
Progress (2): 592 kB | 1.7/2.2 MB
Progress (2): 592 kB | 1.7/2.2 MB
Progress (2): 592 kB | 1.7/2.2 MB
Progress (2): 592 kB | 1.7/2.2 MB
Progress (2): 592 kB | 1.7/2.2 MB
Progress (2): 592 kB | 1.7/2.2 MB
Progress (2): 592 kB | 1.7/2.2 MB
Progress (2): 592 kB | 1.7/2.2 MB
Progress (2): 592 kB | 1.7/2.2 MB
Progress (2): 592 kB | 1.7/2.2 MB
Progress (2): 592 kB | 1.7/2.2 MB
Progress (2): 592 kB | 1.7/2.2 MB
Progress (2): 592 kB | 1.7/2.2 MB
Progress (2): 592 kB | 1.7/2.2 MB
Progress (2): 592 kB | 1.7/2.2 MB
Progress (2): 592 kB | 1.7/2.2 MB
Progress (2): 592 kB | 1.7/2.2 MB
Progress (2): 592 kB | 1.7/2.2 MB
                                 
Downloaded from central: https://repo.maven.apache.org/maven2/org/apache/httpcomponents/httpclient/4.3.6/httpclient-4.3.6.jar (592 kB at 1.7 MB/s)
Progress (1): 1.7/2.2 MB
Progress (1): 1.7/2.2 MB
Progress (1): 1.7/2.2 MB
Progress (1): 1.7/2.2 MB
Progress (1): 1.7/2.2 MB
Progress (1): 1.7/2.2 MB
Progress (1): 1.7/2.2 MB
Progress (1): 1.8/2.2 MB
Progress (1): 1.8/2.2 MB
Progress (1): 1.8/2.2 MB
Progress (1): 1.8/2.2 MB
Progress (1): 1.8/2.2 MB
Progress (1): 1.8/2.2 MB
Progress (1): 1.8/2.2 MB
Progress (1): 1.8/2.2 MB
Progress (1): 1.8/2.2 MB
Progress (1): 1.8/2.2 MB
Progress (1): 1.8/2.2 MB
Progress (1): 1.8/2.2 MB
Progress (1): 1.8/2.2 MB
Progress (1): 1.8/2.2 MB
Progress (1): 1.8/2.2 MB
Progress (1): 1.8/2.2 MB
Progress (1): 1.8/2.2 MB
Progress (1): 1.8/2.2 MB
Progress (1): 1.8/2.2 MB
Progress (1): 1.8/2.2 MB
Progress (1): 1.8/2.2 MB
Progress (1): 1.8/2.2 MB
Progress (1): 1.8/2.2 MB
Progress (1): 1.8/2.2 MB
Progress (1): 1.9/2.2 MB
Progress (1): 1.9/2.2 MB
Progress (1): 1.9/2.2 MB
Progress (1): 1.9/2.2 MB
Progress (1): 1.9/2.2 MB
Progress (1): 1.9/2.2 MB
Progress (1): 1.9/2.2 MB
Progress (1): 1.9/2.2 MB
Progress (1): 1.9/2.2 MB
Progress (1): 1.9/2.2 MB
Progress (1): 1.9/2.2 MB
Progress (1): 1.9/2.2 MB
Progress (1): 1.9/2.2 MB
Progress (1): 1.9/2.2 MB
Progress (1): 1.9/2.2 MB
Progress (1): 1.9/2.2 MB
Progress (1): 1.9/2.2 MB
Progress (1): 1.9/2.2 MB
Progress (1): 1.9/2.2 MB
Progress (1): 1.9/2.2 MB
Progress (1): 1.9/2.2 MB
Progress (1): 1.9/2.2 MB
Progress (1): 1.9/2.2 MB
Progress (1): 1.9/2.2 MB
Progress (1): 1.9/2.2 MB
Progress (1): 2.0/2.2 MB
Progress (1): 2.0/2.2 MB
Progress (1): 2.0/2.2 MB
Progress (1): 2.0/2.2 MB
Progress (1): 2.0/2.2 MB
Progress (1): 2.0/2.2 MB
Progress (1): 2.0/2.2 MB
Progress (1): 2.0/2.2 MB
Progress (1): 2.0/2.2 MB
Progress (1): 2.0/2.2 MB
Progress (1): 2.0/2.2 MB
Progress (1): 2.0/2.2 MB
Progress (1): 2.0/2.2 MB
Progress (1): 2.0/2.2 MB
Progress (1): 2.0/2.2 MB
Progress (1): 2.0/2.2 MB
Progress (1): 2.0/2.2 MB
Progress (1): 2.0/2.2 MB
Progress (1): 2.0/2.2 MB
Progress (1): 2.0/2.2 MB
Progress (1): 2.0/2.2 MB
Progress (1): 2.0/2.2 MB
Progress (1): 2.0/2.2 MB
Progress (1): 2.0/2.2 MB
Progress (1): 2.1/2.2 MB
Progress (1): 2.1/2.2 MB
Progress (1): 2.1/2.2 MB
Progress (1): 2.1/2.2 MB
Progress (1): 2.1/2.2 MB
Progress (1): 2.1/2.2 MB
Progress (1): 2.1/2.2 MB
Progress (1): 2.1/2.2 MB
Progress (1): 2.1/2.2 MB
Progress (1): 2.1/2.2 MB
Progress (1): 2.1/2.2 MB
Progress (1): 2.1/2.2 MB
Progress (1): 2.1/2.2 MB
Progress (1): 2.1/2.2 MB
Progress (1): 2.1/2.2 MB
Progress (1): 2.1/2.2 MB
Progress (1): 2.1/2.2 MB
Progress (1): 2.1/2.2 MB
Progress (1): 2.1/2.2 MB
Progress (1): 2.1/2.2 MB
Progress (1): 2.1/2.2 MB
Progress (1): 2.1/2.2 MB
Progress (1): 2.1/2.2 MB
Progress (1): 2.1/2.2 MB
Progress (1): 2.1/2.2 MB
Progress (1): 2.2/2.2 MB
Progress (1): 2.2/2.2 MB
Progress (1): 2.2/2.2 MB
Progress (1): 2.2 MB    
                    
Downloaded from central: https://repo.maven.apache.org/maven2/org/eclipse/jgit/org.eclipse.jgit/4.1.0.201509280440-r/org.eclipse.jgit-4.1.0.201509280440-r.jar (2.2 MB at 5.2 MB/s)
[INFO] Set property "describe" to "git:BungeeCord-Parent:1.12-SNAPSHOT:aadfe0b:unknown"
[INFO] 
[INFO] --- animal-sniffer-maven-plugin:1.16:check (default) @ bungeecord-parent ---
Downloading from central: https://repo.maven.apache.org/maven2/org/codehaus/mojo/animal-sniffer/1.16/animal-sniffer-1.16.pom
Progress (1): 2.2/2.4 kB
Progress (1): 2.4 kB    
                    
Downloaded from central: https://repo.maven.apache.org/maven2/org/codehaus/mojo/animal-sniffer/1.16/animal-sniffer-1.16.pom (2.4 kB at 31 kB/s)
Downloading from central: https://repo.maven.apache.org/maven2/org/ow2/asm/asm-all/5.2/asm-all-5.2.pom
Progress (1): 2.0 kB
                    
Downloaded from central: https://repo.maven.apache.org/maven2/org/ow2/asm/asm-all/5.2/asm-all-5.2.pom (2.0 kB at 36 kB/s)
Downloading from central: https://repo.maven.apache.org/maven2/org/ow2/asm/asm-parent/5.2/asm-parent-5.2.pom
Progress (1): 2.2/5.5 kB
Progress (1): 5.0/5.5 kB
Progress (1): 5.5 kB    
                    
Downloaded from central: https://repo.maven.apache.org/maven2/org/ow2/asm/asm-parent/5.2/asm-parent-5.2.pom (5.5 kB at 98 kB/s)
Downloading from central: https://repo.maven.apache.org/maven2/org/codehaus/mojo/java-boot-classpath-detector/1.16/java-boot-classpath-detector-1.16.pom
Progress (1): 2.2/2.5 kB
Progress (1): 2.5 kB    
                    
Downloaded from central: https://repo.maven.apache.org/maven2/org/codehaus/mojo/java-boot-classpath-detector/1.16/java-boot-classpath-detector-1.16.pom (2.5 kB at 37 kB/s)
Downloading from central: https://repo.maven.apache.org/maven2/junit/junit/4.11/junit-4.11.pom
Downloaded from central: https://repo.maven.apache.org/maven2/junit/junit/4.11/junit-4.11.pom (0 B at 0 B/s)
Downloading from central: https://repo.maven.apache.org/maven2/org/apache/maven/maven-toolchain/2.2.1/maven-toolchain-2.2.1.pom
Downloaded from central: https://repo.maven.apache.org/maven2/org/apache/maven/maven-toolchain/2.2.1/maven-toolchain-2.2.1.pom (0 B at 0 B/s)
Downloading from central: https://repo.maven.apache.org/maven2/org/codehaus/mojo/animal-sniffer/1.16/animal-sniffer-1.16.jar
Downloading from central: https://repo.maven.apache.org/maven2/org/ow2/asm/asm-all/5.2/asm-all-5.2.jar
Downloading from central: https://repo.maven.apache.org/maven2/org/codehaus/mojo/java-boot-classpath-detector/1.16/java-boot-classpath-detector-1.16.jar
Downloading from central: https://repo.maven.apache.org/maven2/org/apache/maven/maven-toolchain/2.2.1/maven-toolchain-2.2.1.jar
Downloading from central: https://repo.maven.apache.org/maven2/org/codehaus/plexus/plexus-utils/1.5.6/plexus-utils-1.5.6.jar
Progress (1): 2.2/35 kB
Progress (1): 5.0/35 kB
Progress (1): 7.7/35 kB
Progress (1): 10/35 kB 
Progress (1): 13/35 kB
Progress (1): 16/35 kB
Progress (1): 19/35 kB
Progress (1): 21/35 kB
Progress (1): 24/35 kB
Progress (1): 27/35 kB
Progress (1): 30/35 kB
Progress (1): 32/35 kB
Progress (1): 35 kB   
                   
Downloaded from central: https://repo.maven.apache.org/maven2/org/apache/maven/maven-toolchain/2.2.1/maven-toolchain-2.2.1.jar (0 B at 0 B/s)
Progress (2): 35 kB | 2.2/248 kB
Progress (2): 35 kB | 5.0/248 kB
Progress (2): 35 kB | 7.7/248 kB
Progress (2): 35 kB | 10/248 kB 
                               
Downloaded from central: https://repo.maven.apache.org/maven2/org/codehaus/plexus/plexus-utils/1.5.6/plexus-utils-1.5.6.jar (0 B at 0 B/s)
Downloaded from central: https://repo.maven.apache.org/maven2/org/codehaus/mojo/animal-sniffer/1.16/animal-sniffer-1.16.jar (35 kB at 517 kB/s)
Progress (2): 10/248 kB | 2.2/5.0 kB
Progress (2): 10/248 kB | 5.0/5.0 kB
Progress (2): 10/248 kB | 5.0 kB    
Progress (2): 13/248 kB | 5.0 kB
Progress (2): 16/248 kB | 5.0 kB
Progress (2): 19/248 kB | 5.0 kB
Progress (2): 21/248 kB | 5.0 kB
Progress (2): 24/248 kB | 5.0 kB
Progress (2): 27/248 kB | 5.0 kB
Progress (2): 30/248 kB | 5.0 kB
Progress (2): 32/248 kB | 5.0 kB
Progress (2): 36/248 kB | 5.0 kB
Progress (2): 40/248 kB | 5.0 kB
Progress (2): 45/248 kB | 5.0 kB
Progress (2): 49/248 kB | 5.0 kB
Progress (2): 53/248 kB | 5.0 kB
Progress (2): 57/248 kB | 5.0 kB
Progress (2): 61/248 kB | 5.0 kB
Progress (2): 65/248 kB | 5.0 kB
                                
Downloaded from central: https://repo.maven.apache.org/maven2/org/codehaus/mojo/java-boot-classpath-detector/1.16/java-boot-classpath-detector-1.16.jar (5.0 kB at 48 kB/s)
Progress (1): 69/248 kB
Progress (1): 73/248 kB
Progress (1): 77/248 kB
Progress (1): 81/248 kB
Progress (1): 85/248 kB
Progress (1): 90/248 kB
Progress (1): 94/248 kB
Progress (1): 98/248 kB
Progress (1): 102/248 kB
Progress (1): 106/248 kB
Progress (1): 110/248 kB
Progress (1): 114/248 kB
Progress (1): 118/248 kB
Progress (1): 122/248 kB
Progress (1): 126/248 kB
Progress (1): 131/248 kB
Progress (1): 135/248 kB
Progress (1): 139/248 kB
Progress (1): 143/248 kB
Progress (1): 147/248 kB
Progress (1): 151/248 kB
Progress (1): 155/248 kB
Progress (1): 159/248 kB
Progress (1): 163/248 kB
Progress (1): 167/248 kB
Progress (1): 171/248 kB
Progress (1): 176/248 kB
Progress (1): 180/248 kB
Progress (1): 184/248 kB
Progress (1): 188/248 kB
Progress (1): 192/248 kB
Progress (1): 196/248 kB
Progress (1): 200/248 kB
Progress (1): 204/248 kB
Progress (1): 208/248 kB
Progress (1): 212/248 kB
Progress (1): 217/248 kB
Progress (1): 221/248 kB
Progress (1): 225/248 kB
Progress (1): 229/248 kB
Progress (1): 233/248 kB
Progress (1): 237/248 kB
Progress (1): 241/248 kB
Progress (1): 245/248 kB
Progress (1): 248 kB    
                    
Downloaded from central: https://repo.maven.apache.org/maven2/org/ow2/asm/asm-all/5.2/asm-all-5.2.jar (248 kB at 1.2 MB/s)
[INFO] Checking unresolved references to org.codehaus.mojo.signature:java17:1.0
Downloading from central: https://repo.maven.apache.org/maven2/org/codehaus/mojo/signature/java17/1.0/java17-1.0.signature
Progress (1): 4.1/664 kB
Progress (1): 7.7/664 kB
Progress (1): 12/664 kB 
Progress (1): 16/664 kB
Progress (1): 20/664 kB
Progress (1): 24/664 kB
Progress (1): 28/664 kB
Progress (1): 32/664 kB
Progress (1): 36/664 kB
Progress (1): 40/664 kB
Progress (1): 45/664 kB
Progress (1): 49/664 kB
Progress (1): 53/664 kB
Progress (1): 57/664 kB
Progress (1): 61/664 kB
Progress (1): 65/664 kB
Progress (1): 69/664 kB
Progress (1): 73/664 kB
Progress (1): 77/664 kB
Progress (1): 81/664 kB
Progress (1): 85/664 kB
Progress (1): 90/664 kB
Progress (1): 94/664 kB
Progress (1): 98/664 kB
Progress (1): 102/664 kB
Progress (1): 106/664 kB
Progress (1): 110/664 kB
Progress (1): 114/664 kB
Progress (1): 118/664 kB
Progress (1): 122/664 kB
Progress (1): 126/664 kB
Progress (1): 131/664 kB
Progress (1): 135/664 kB
Progress (1): 139/664 kB
Progress (1): 143/664 kB
Progress (1): 147/664 kB
Progress (1): 151/664 kB
Progress (1): 155/664 kB
Progress (1): 159/664 kB
Progress (1): 163/664 kB
Progress (1): 167/664 kB
Progress (1): 171/664 kB
Progress (1): 176/664 kB
Progress (1): 180/664 kB
Progress (1): 184/664 kB
Progress (1): 188/664 kB
Progress (1): 192/664 kB
Progress (1): 196/664 kB
Progress (1): 200/664 kB
Progress (1): 204/664 kB
Progress (1): 208/664 kB
Progress (1): 212/664 kB
Progress (1): 217/664 kB
Progress (1): 221/664 kB
Progress (1): 225/664 kB
Progress (1): 229/664 kB
Progress (1): 233/664 kB
Progress (1): 237/664 kB
Progress (1): 241/664 kB
Progress (1): 245/664 kB
Progress (1): 249/664 kB
Progress (1): 253/664 kB
Progress (1): 258/664 kB
Progress (1): 262/664 kB
Progress (1): 266/664 kB
Progress (1): 270/664 kB
Progress (1): 274/664 kB
Progress (1): 278/664 kB
Progress (1): 282/664 kB
Progress (1): 286/664 kB
Progress (1): 290/664 kB
Progress (1): 294/664 kB
Progress (1): 298/664 kB
Progress (1): 303/664 kB
Progress (1): 307/664 kB
Progress (1): 311/664 kB
Progress (1): 315/664 kB
Progress (1): 319/664 kB
Progress (1): 323/664 kB
Progress (1): 327/664 kB
Progress (1): 331/664 kB
Progress (1): 335/664 kB
Progress (1): 339/664 kB
Progress (1): 344/664 kB
Progress (1): 348/664 kB
Progress (1): 352/664 kB
Progress (1): 356/664 kB
Progress (1): 360/664 kB
Progress (1): 364/664 kB
Progress (1): 368/664 kB
Progress (1): 372/664 kB
Progress (1): 376/664 kB
Progress (1): 380/664 kB
Progress (1): 384/664 kB
Progress (1): 389/664 kB
Progress (1): 393/664 kB
Progress (1): 397/664 kB
Progress (1): 401/664 kB
Progress (1): 405/664 kB
Progress (1): 409/664 kB
Progress (1): 413/664 kB
Progress (1): 417/664 kB
Progress (1): 421/664 kB
Progress (1): 425/664 kB
Progress (1): 430/664 kB
Progress (1): 434/664 kB
Progress (1): 438/664 kB
Progress (1): 442/664 kB
Progress (1): 446/664 kB
Progress (1): 450/664 kB
Progress (1): 454/664 kB
Progress (1): 458/664 kB
Progress (1): 462/664 kB
Progress (1): 466/664 kB
Progress (1): 470/664 kB
Progress (1): 475/664 kB
Progress (1): 479/664 kB
Progress (1): 483/664 kB
Progress (1): 487/664 kB
Progress (1): 491/664 kB
Progress (1): 495/664 kB
Progress (1): 499/664 kB
Progress (1): 503/664 kB
Progress (1): 507/664 kB
Progress (1): 511/664 kB
Progress (1): 516/664 kB
Progress (1): 520/664 kB
Progress (1): 524/664 kB
Progress (1): 528/664 kB
Progress (1): 532/664 kB
Progress (1): 536/664 kB
Progress (1): 540/664 kB
Progress (1): 544/664 kB
Progress (1): 548/664 kB
Progress (1): 552/664 kB
Progress (1): 557/664 kB
Progress (1): 561/664 kB
Progress (1): 565/664 kB
Progress (1): 569/664 kB
Progress (1): 573/664 kB
Progress (1): 577/664 kB
Progress (1): 581/664 kB
Progress (1): 585/664 kB
Progress (1): 589/664 kB
Progress (1): 593/664 kB
Progress (1): 597/664 kB
Progress (1): 602/664 kB
Progress (1): 606/664 kB
Progress (1): 610/664 kB
Progress (1): 614/664 kB
Progress (1): 618/664 kB
Progress (1): 622/664 kB
Progress (1): 626/664 kB
Progress (1): 630/664 kB
Progress (1): 634/664 kB
Progress (1): 638/664 kB
Progress (1): 643/664 kB
Progress (1): 647/664 kB
Progress (1): 651/664 kB
Progress (1): 655/664 kB
Progress (1): 659/664 kB
Progress (1): 663/664 kB
Progress (1): 664 kB    
                    
Downloaded from central: https://repo.maven.apache.org/maven2/org/codehaus/mojo/signature/java17/1.0/java17-1.0.signature (664 kB at 2.0 MB/s)
[INFO] 
[INFO] --- maven-install-plugin:2.4:install (default-install) @ bungeecord-parent ---
[INFO] Installing /home/jenkins/workspace/Bungeecord 1.7.10 Patch/BungeeCord/pom.xml to /home/jenkins/.m2/repository/net/md-5/bungeecord-parent/1.12-SNAPSHOT/bungeecord-parent-1.12-SNAPSHOT.pom
[INFO] 
[INFO] ----------------------< net.md-5:bungeecord-chat >----------------------
[INFO] Building BungeeCord-Chat 1.12-SNAPSHOT                            [2/18]
[INFO] --------------------------------[ jar ]---------------------------------
Downloading from central: https://repo.maven.apache.org/maven2/org/apache/maven/plugins/maven-compiler-plugin/3.1/maven-compiler-plugin-3.1.pom
Downloaded from central: https://repo.maven.apache.org/maven2/org/apache/maven/plugins/maven-compiler-plugin/3.1/maven-compiler-plugin-3.1.pom (0 B at 0 B/s)
Downloading from central: https://repo.maven.apache.org/maven2/org/apache/maven/plugins/maven-plugins/24/maven-plugins-24.pom
Downloaded from central: https://repo.maven.apache.org/maven2/org/apache/maven/plugins/maven-plugins/24/maven-plugins-24.pom (0 B at 0 B/s)
Downloading from central: https://repo.maven.apache.org/maven2/org/apache/maven/plugins/maven-compiler-plugin/3.1/maven-compiler-plugin-3.1.jar
Downloaded from central: https://repo.maven.apache.org/maven2/org/apache/maven/plugins/maven-compiler-plugin/3.1/maven-compiler-plugin-3.1.jar (0 B at 0 B/s)
[INFO] 
[INFO] --- maven-clean-plugin:2.5:clean (default-clean) @ bungeecord-chat ---
[INFO] 
[INFO] --- scriptus:0.3.1:describe (default) @ bungeecord-chat ---
[INFO] Set property "describe" to "git:BungeeCord-Chat:1.12-SNAPSHOT:aadfe0b:unknown"
[INFO] 
[INFO] --- maven-resources-plugin:2.6:resources (default-resources) @ bungeecord-chat ---
[INFO] Using 'UTF-8' encoding to copy filtered resources.
[INFO] Copying 1 resource
[INFO] 
[INFO] --- maven-compiler-plugin:3.1:compile (default-compile) @ bungeecord-chat ---
Downloading from central: https://repo.maven.apache.org/maven2/org/apache/maven/shared/maven-shared-utils/0.1/maven-shared-utils-0.1.pom
Downloaded from central: https://repo.maven.apache.org/maven2/org/apache/maven/shared/maven-shared-utils/0.1/maven-shared-utils-0.1.pom (0 B at 0 B/s)
Downloading from central: https://repo.maven.apache.org/maven2/org/apache/maven/shared/maven-shared-incremental/1.1/maven-shared-incremental-1.1.pom
Downloaded from central: https://repo.maven.apache.org/maven2/org/apache/maven/shared/maven-shared-incremental/1.1/maven-shared-incremental-1.1.pom (0 B at 0 B/s)
Downloading from central: https://repo.maven.apache.org/maven2/org/codehaus/plexus/plexus-component-annotations/1.5.5/plexus-component-annotations-1.5.5.pom
Downloaded from central: https://repo.maven.apache.org/maven2/org/codehaus/plexus/plexus-component-annotations/1.5.5/plexus-component-annotations-1.5.5.pom (0 B at 0 B/s)
Downloading from central: https://repo.maven.apache.org/maven2/org/codehaus/plexus/plexus-compiler-api/2.2/plexus-compiler-api-2.2.pom
Downloaded from central: https://repo.maven.apache.org/maven2/org/codehaus/plexus/plexus-compiler-api/2.2/plexus-compiler-api-2.2.pom (0 B at 0 B/s)
Downloading from central: https://repo.maven.apache.org/maven2/org/codehaus/plexus/plexus-compiler/2.2/plexus-compiler-2.2.pom
Downloaded from central: https://repo.maven.apache.org/maven2/org/codehaus/plexus/plexus-compiler/2.2/plexus-compiler-2.2.pom (0 B at 0 B/s)
Downloading from central: https://repo.maven.apache.org/maven2/org/codehaus/plexus/plexus-compiler-manager/2.2/plexus-compiler-manager-2.2.pom
Downloaded from central: https://repo.maven.apache.org/maven2/org/codehaus/plexus/plexus-compiler-manager/2.2/plexus-compiler-manager-2.2.pom (0 B at 0 B/s)
Downloading from central: https://repo.maven.apache.org/maven2/org/codehaus/plexus/plexus-compiler-javac/2.2/plexus-compiler-javac-2.2.pom
Downloaded from central: https://repo.maven.apache.org/maven2/org/codehaus/plexus/plexus-compiler-javac/2.2/plexus-compiler-javac-2.2.pom (0 B at 0 B/s)
Downloading from central: https://repo.maven.apache.org/maven2/org/codehaus/plexus/plexus-compilers/2.2/plexus-compilers-2.2.pom
Downloaded from central: https://repo.maven.apache.org/maven2/org/codehaus/plexus/plexus-compilers/2.2/plexus-compilers-2.2.pom (0 B at 0 B/s)
Downloading from central: https://repo.maven.apache.org/maven2/org/apache/maven/shared/maven-shared-utils/0.1/maven-shared-utils-0.1.jar
Downloading from central: https://repo.maven.apache.org/maven2/org/codehaus/plexus/plexus-compiler-javac/2.2/plexus-compiler-javac-2.2.jar
Downloading from central: https://repo.maven.apache.org/maven2/org/apache/maven/shared/maven-shared-incremental/1.1/maven-shared-incremental-1.1.jar
Downloading from central: https://repo.maven.apache.org/maven2/org/codehaus/plexus/plexus-compiler-manager/2.2/plexus-compiler-manager-2.2.jar
Downloading from central: https://repo.maven.apache.org/maven2/org/codehaus/plexus/plexus-compiler-api/2.2/plexus-compiler-api-2.2.jar
Downloaded from central: https://repo.maven.apache.org/maven2/org/codehaus/plexus/plexus-compiler-api/2.2/plexus-compiler-api-2.2.jar (0 B at 0 B/s)
Downloading from central: https://repo.maven.apache.org/maven2/org/codehaus/plexus/plexus-container-default/1.5.5/plexus-container-default-1.5.5.jar
Downloaded from central: https://repo.maven.apache.org/maven2/org/codehaus/plexus/plexus-compiler-manager/2.2/plexus-compiler-manager-2.2.jar (0 B at 0 B/s)
Downloading from central: https://repo.maven.apache.org/maven2/org/codehaus/plexus/plexus-classworlds/2.2.2/plexus-classworlds-2.2.2.jar
Downloaded from central: https://repo.maven.apache.org/maven2/org/apache/maven/shared/maven-shared-incremental/1.1/maven-shared-incremental-1.1.jar (0 B at 0 B/s)
Downloading from central: https://repo.maven.apache.org/maven2/org/apache/xbean/xbean-reflect/3.4/xbean-reflect-3.4.jar
Downloaded from central: https://repo.maven.apache.org/maven2/org/apache/maven/shared/maven-shared-utils/0.1/maven-shared-utils-0.1.jar (0 B at 0 B/s)
Downloading from central: https://repo.maven.apache.org/maven2/log4j/log4j/1.2.12/log4j-1.2.12.jar
Downloaded from central: https://repo.maven.apache.org/maven2/org/codehaus/plexus/plexus-compiler-javac/2.2/plexus-compiler-javac-2.2.jar (0 B at 0 B/s)
Downloading from central: https://repo.maven.apache.org/maven2/commons-logging/commons-logging-api/1.1/commons-logging-api-1.1.jar
Downloaded from central: https://repo.maven.apache.org/maven2/org/apache/xbean/xbean-reflect/3.4/xbean-reflect-3.4.jar (0 B at 0 B/s)
Downloading from central: https://repo.maven.apache.org/maven2/com/google/collections/google-collections/1.0/google-collections-1.0.jar
Downloaded from central: https://repo.maven.apache.org/maven2/org/codehaus/plexus/plexus-classworlds/2.2.2/plexus-classworlds-2.2.2.jar (0 B at 0 B/s)
Downloading from central: https://repo.maven.apache.org/maven2/junit/junit/3.8.2/junit-3.8.2.jar
Downloaded from central: https://repo.maven.apache.org/maven2/org/codehaus/plexus/plexus-container-default/1.5.5/plexus-container-default-1.5.5.jar (0 B at 0 B/s)
Downloaded from central: https://repo.maven.apache.org/maven2/commons-logging/commons-logging-api/1.1/commons-logging-api-1.1.jar (0 B at 0 B/s)
Downloaded from central: https://repo.maven.apache.org/maven2/log4j/log4j/1.2.12/log4j-1.2.12.jar (0 B at 0 B/s)
Downloaded from central: https://repo.maven.apache.org/maven2/com/google/collections/google-collections/1.0/google-collections-1.0.jar (0 B at 0 B/s)
Downloaded from central: https://repo.maven.apache.org/maven2/junit/junit/3.8.2/junit-3.8.2.jar (0 B at 0 B/s)
[INFO] Changes detected - recompiling the module!
[INFO] Compiling 15 source files to /home/jenkins/workspace/Bungeecord 1.7.10 Patch/BungeeCord/chat/target/classes
[INFO] 
[INFO] --- animal-sniffer-maven-plugin:1.16:check (default) @ bungeecord-chat ---
[INFO] Checking unresolved references to org.codehaus.mojo.signature:java17:1.0
[INFO] 
[INFO] --- maven-resources-plugin:2.6:testResources (default-testResources) @ bungeecord-chat ---
[INFO] Using 'UTF-8' encoding to copy filtered resources.
[INFO] skip non existing resourceDirectory /home/jenkins/workspace/Bungeecord 1.7.10 Patch/BungeeCord/chat/src/test/resources
[INFO] 
[INFO] --- maven-compiler-plugin:3.1:testCompile (default-testCompile) @ bungeecord-chat ---
[INFO] Changes detected - recompiling the module!
[INFO] Compiling 1 source file to /home/jenkins/workspace/Bungeecord 1.7.10 Patch/BungeeCord/chat/target/test-classes
[INFO] 
[INFO] --- maven-surefire-plugin:2.12.4:test (default-test) @ bungeecord-chat ---
[INFO] Surefire report directory: /home/jenkins/workspace/Bungeecord 1.7.10 Patch/BungeeCord/chat/target/surefire-reports
Downloading from central: https://repo.maven.apache.org/maven2/org/apache/maven/surefire/surefire-junit4/2.12.4/surefire-junit4-2.12.4.pom
Downloaded from central: https://repo.maven.apache.org/maven2/org/apache/maven/surefire/surefire-junit4/2.12.4/surefire-junit4-2.12.4.pom (0 B at 0 B/s)
Downloading from central: https://repo.maven.apache.org/maven2/org/apache/maven/surefire/surefire-providers/2.12.4/surefire-providers-2.12.4.pom
Downloaded from central: https://repo.maven.apache.org/maven2/org/apache/maven/surefire/surefire-providers/2.12.4/surefire-providers-2.12.4.pom (0 B at 0 B/s)
Downloading from central: https://repo.maven.apache.org/maven2/org/apache/maven/surefire/surefire-junit4/2.12.4/surefire-junit4-2.12.4.jar
Downloaded from central: https://repo.maven.apache.org/maven2/org/apache/maven/surefire/surefire-junit4/2.12.4/surefire-junit4-2.12.4.jar (0 B at 0 B/s)

-------------------------------------------------------
 T E S T S
-------------------------------------------------------
Running net.md_5.bungee.api.chat.TranslatableComponentTest
Tests run: 1, Failures: 0, Errors: 0, Skipped: 0, Time elapsed: 0.005 sec

Results :

Tests run: 1, Failures: 0, Errors: 0, Skipped: 0

[INFO] 
[INFO] --- maven-jar-plugin:2.4:jar (default-jar) @ bungeecord-chat ---
[INFO] Building jar: /home/jenkins/workspace/Bungeecord 1.7.10 Patch/BungeeCord/chat/target/bungeecord-chat-1.12-SNAPSHOT.jar
[INFO] 
[INFO] --- maven-install-plugin:2.4:install (default-install) @ bungeecord-chat ---
[INFO] Installing /home/jenkins/workspace/Bungeecord 1.7.10 Patch/BungeeCord/chat/target/bungeecord-chat-1.12-SNAPSHOT.jar to /home/jenkins/.m2/repository/net/md-5/bungeecord-chat/1.12-SNAPSHOT/bungeecord-chat-1.12-SNAPSHOT.jar
[INFO] Installing /home/jenkins/workspace/Bungeecord 1.7.10 Patch/BungeeCord/chat/pom.xml to /home/jenkins/.m2/repository/net/md-5/bungeecord-chat/1.12-SNAPSHOT/bungeecord-chat-1.12-SNAPSHOT.pom
[INFO] 
[INFO] ---------------------< net.md-5:bungeecord-config >---------------------
[INFO] Building BungeeCord-Config 1.12-SNAPSHOT                          [3/18]
[INFO] --------------------------------[ jar ]---------------------------------
Downloading from central: https://repo.maven.apache.org/maven2/org/yaml/snakeyaml/1.19/snakeyaml-1.19.pom
Downloaded from central: https://repo.maven.apache.org/maven2/org/yaml/snakeyaml/1.19/snakeyaml-1.19.pom (0 B at 0 B/s)
Downloading from central: https://repo.maven.apache.org/maven2/org/yaml/snakeyaml/1.19/snakeyaml-1.19.jar
Downloaded from central: https://repo.maven.apache.org/maven2/org/yaml/snakeyaml/1.19/snakeyaml-1.19.jar (0 B at 0 B/s)
[INFO] 
[INFO] --- maven-clean-plugin:2.5:clean (default-clean) @ bungeecord-config ---
[INFO] 
[INFO] --- scriptus:0.3.1:describe (default) @ bungeecord-config ---
[INFO] Set property "describe" to "git:BungeeCord-Config:1.12-SNAPSHOT:aadfe0b:unknown"
[INFO] 
[INFO] --- maven-resources-plugin:2.6:resources (default-resources) @ bungeecord-config ---
[INFO] Using 'UTF-8' encoding to copy filtered resources.
[INFO] skip non existing resourceDirectory /home/jenkins/workspace/Bungeecord 1.7.10 Patch/BungeeCord/config/src/main/resources
[INFO] 
[INFO] --- maven-compiler-plugin:3.1:compile (default-compile) @ bungeecord-config ---
[INFO] Changes detected - recompiling the module!
[INFO] Compiling 3 source files to /home/jenkins/workspace/Bungeecord 1.7.10 Patch/BungeeCord/config/target/classes
[INFO] 
[INFO] --- animal-sniffer-maven-plugin:1.16:check (default) @ bungeecord-config ---
[INFO] Checking unresolved references to org.codehaus.mojo.signature:java17:1.0
[INFO] 
[INFO] --- maven-resources-plugin:2.6:testResources (default-testResources) @ bungeecord-config ---
[INFO] Using 'UTF-8' encoding to copy filtered resources.
[INFO] skip non existing resourceDirectory /home/jenkins/workspace/Bungeecord 1.7.10 Patch/BungeeCord/config/src/test/resources
[INFO] 
[INFO] --- maven-compiler-plugin:3.1:testCompile (default-testCompile) @ bungeecord-config ---
[INFO] Changes detected - recompiling the module!
[INFO] Compiling 1 source file to /home/jenkins/workspace/Bungeecord 1.7.10 Patch/BungeeCord/config/target/test-classes
[INFO] 
[INFO] --- maven-surefire-plugin:2.12.4:test (default-test) @ bungeecord-config ---
[INFO] Surefire report directory: /home/jenkins/workspace/Bungeecord 1.7.10 Patch/BungeeCord/config/target/surefire-reports

-------------------------------------------------------
 T E S T S
-------------------------------------------------------
Running net.md_5.bungee.config.YamlConfigurationTest
Tests run: 4, Failures: 0, Errors: 0, Skipped: 0, Time elapsed: 0.18 sec

Results :

Tests run: 4, Failures: 0, Errors: 0, Skipped: 0

[INFO] 
[INFO] --- maven-jar-plugin:2.4:jar (default-jar) @ bungeecord-config ---
[INFO] Building jar: /home/jenkins/workspace/Bungeecord 1.7.10 Patch/BungeeCord/config/target/bungeecord-config-1.12-SNAPSHOT.jar
[INFO] 
[INFO] --- maven-install-plugin:2.4:install (default-install) @ bungeecord-config ---
[INFO] Installing /home/jenkins/workspace/Bungeecord 1.7.10 Patch/BungeeCord/config/target/bungeecord-config-1.12-SNAPSHOT.jar to /home/jenkins/.m2/repository/net/md-5/bungeecord-config/1.12-SNAPSHOT/bungeecord-config-1.12-SNAPSHOT.jar
[INFO] Installing /home/jenkins/workspace/Bungeecord 1.7.10 Patch/BungeeCord/config/pom.xml to /home/jenkins/.m2/repository/net/md-5/bungeecord-config/1.12-SNAPSHOT/bungeecord-config-1.12-SNAPSHOT.pom
[INFO] 
[INFO] ---------------------< net.md-5:bungeecord-event >----------------------
[INFO] Building BungeeCord-Event 1.12-SNAPSHOT                           [4/18]
[INFO] --------------------------------[ jar ]---------------------------------
[INFO] 
[INFO] --- maven-clean-plugin:2.5:clean (default-clean) @ bungeecord-event ---
[INFO] 
[INFO] --- scriptus:0.3.1:describe (default) @ bungeecord-event ---
[INFO] Set property "describe" to "git:BungeeCord-Event:1.12-SNAPSHOT:aadfe0b:unknown"
[INFO] 
[INFO] --- maven-resources-plugin:2.6:resources (default-resources) @ bungeecord-event ---
[INFO] Using 'UTF-8' encoding to copy filtered resources.
[INFO] skip non existing resourceDirectory /home/jenkins/workspace/Bungeecord 1.7.10 Patch/BungeeCord/event/src/main/resources
[INFO] 
[INFO] --- maven-compiler-plugin:3.1:compile (default-compile) @ bungeecord-event ---
[INFO] Changes detected - recompiling the module!
[INFO] Compiling 4 source files to /home/jenkins/workspace/Bungeecord 1.7.10 Patch/BungeeCord/event/target/classes
[INFO] 
[INFO] --- animal-sniffer-maven-plugin:1.16:check (default) @ bungeecord-event ---
[INFO] Checking unresolved references to org.codehaus.mojo.signature:java17:1.0
[INFO] 
[INFO] --- maven-resources-plugin:2.6:testResources (default-testResources) @ bungeecord-event ---
[INFO] Using 'UTF-8' encoding to copy filtered resources.
[INFO] skip non existing resourceDirectory /home/jenkins/workspace/Bungeecord 1.7.10 Patch/BungeeCord/event/src/test/resources
[INFO] 
[INFO] --- maven-compiler-plugin:3.1:testCompile (default-testCompile) @ bungeecord-event ---
[INFO] Changes detected - recompiling the module!
[INFO] Compiling 3 source files to /home/jenkins/workspace/Bungeecord 1.7.10 Patch/BungeeCord/event/target/test-classes
[INFO] 
[INFO] --- maven-surefire-plugin:2.12.4:test (default-test) @ bungeecord-event ---
[INFO] Surefire report directory: /home/jenkins/workspace/Bungeecord 1.7.10 Patch/BungeeCord/event/target/surefire-reports

-------------------------------------------------------
 T E S T S
-------------------------------------------------------
Running net.md_5.bungee.event.UnregisteringListenerTest
Tests run: 1, Failures: 0, Errors: 0, Skipped: 0, Time elapsed: 0.05 sec
Running net.md_5.bungee.event.EventPriorityTest
Tests run: 1, Failures: 0, Errors: 0, Skipped: 0, Time elapsed: 0.001 sec
Running net.md_5.bungee.event.EventBusTest
Tests run: 1, Failures: 0, Errors: 0, Skipped: 0, Time elapsed: 0 sec

Results :

Tests run: 3, Failures: 0, Errors: 0, Skipped: 0

[INFO] 
[INFO] --- maven-jar-plugin:2.4:jar (default-jar) @ bungeecord-event ---
[INFO] Building jar: /home/jenkins/workspace/Bungeecord 1.7.10 Patch/BungeeCord/event/target/bungeecord-event-1.12-SNAPSHOT.jar
[INFO] 
[INFO] --- maven-install-plugin:2.4:install (default-install) @ bungeecord-event ---
[INFO] Installing /home/jenkins/workspace/Bungeecord 1.7.10 Patch/BungeeCord/event/target/bungeecord-event-1.12-SNAPSHOT.jar to /home/jenkins/.m2/repository/net/md-5/bungeecord-event/1.12-SNAPSHOT/bungeecord-event-1.12-SNAPSHOT.jar
[INFO] Installing /home/jenkins/workspace/Bungeecord 1.7.10 Patch/BungeeCord/event/pom.xml to /home/jenkins/.m2/repository/net/md-5/bungeecord-event/1.12-SNAPSHOT/bungeecord-event-1.12-SNAPSHOT.pom
[INFO] 
[INFO] --------------------< net.md-5:bungeecord-protocol >--------------------
[INFO] Building BungeeCord-Protocol 1.12-SNAPSHOT                        [5/18]
[INFO] --------------------------------[ jar ]---------------------------------
Downloading from central: https://repo.maven.apache.org/maven2/io/netty/netty-codec/4.1.18.Final/netty-codec-4.1.18.Final.pom
Progress (1): 2.2/3.3 kB
Progress (1): 3.3 kB    
                    
Downloaded from central: https://repo.maven.apache.org/maven2/io/netty/netty-codec/4.1.18.Final/netty-codec-4.1.18.Final.pom (3.3 kB at 33 kB/s)
Downloading from central: https://repo.maven.apache.org/maven2/io/netty/netty-parent/4.1.18.Final/netty-parent-4.1.18.Final.pom
Progress (1): 2.2/52 kB
Progress (1): 5.0/52 kB
Progress (1): 7.8/52 kB
Progress (1): 11/52 kB 
Progress (1): 13/52 kB
Progress (1): 16/52 kB
Progress (1): 19/52 kB
Progress (1): 21/52 kB
Progress (1): 24/52 kB
Progress (1): 27/52 kB
Progress (1): 30/52 kB
Progress (1): 32/52 kB
Progress (1): 36/52 kB
Progress (1): 40/52 kB
Progress (1): 45/52 kB
Progress (1): 49/52 kB
Progress (1): 52 kB   
                   
Downloaded from central: https://repo.maven.apache.org/maven2/io/netty/netty-parent/4.1.18.Final/netty-parent-4.1.18.Final.pom (52 kB at 769 kB/s)
Downloading from central: https://repo.maven.apache.org/maven2/io/netty/netty-transport/4.1.18.Final/netty-transport-4.1.18.Final.pom
Progress (1): 1.8 kB
                    
Downloaded from central: https://repo.maven.apache.org/maven2/io/netty/netty-transport/4.1.18.Final/netty-transport-4.1.18.Final.pom (1.8 kB at 28 kB/s)
Downloading from central: https://repo.maven.apache.org/maven2/io/netty/netty-buffer/4.1.18.Final/netty-buffer-4.1.18.Final.pom
Progress (1): 1.6 kB
                    
Downloaded from central: https://repo.maven.apache.org/maven2/io/netty/netty-buffer/4.1.18.Final/netty-buffer-4.1.18.Final.pom (1.6 kB at 25 kB/s)
Downloading from central: https://repo.maven.apache.org/maven2/io/netty/netty-common/4.1.18.Final/netty-common-4.1.18.Final.pom
Progress (1): 2.2/8.4 kB
Progress (1): 5.0/8.4 kB
Progress (1): 7.8/8.4 kB
Progress (1): 8.4 kB    
                    
Downloaded from central: https://repo.maven.apache.org/maven2/io/netty/netty-common/4.1.18.Final/netty-common-4.1.18.Final.pom (8.4 kB at 122 kB/s)
Downloading from central: https://repo.maven.apache.org/maven2/io/netty/netty-resolver/4.1.18.Final/netty-resolver-4.1.18.Final.pom
Progress (1): 1.6 kB
                    
Downloaded from central: https://repo.maven.apache.org/maven2/io/netty/netty-resolver/4.1.18.Final/netty-resolver-4.1.18.Final.pom (1.6 kB at 19 kB/s)
Downloading from central: https://repo.maven.apache.org/maven2/io/netty/netty-codec/4.1.18.Final/netty-codec-4.1.18.Final.jar
Downloading from central: https://repo.maven.apache.org/maven2/io/netty/netty-transport/4.1.18.Final/netty-transport-4.1.18.Final.jar
Downloading from central: https://repo.maven.apache.org/maven2/io/netty/netty-buffer/4.1.18.Final/netty-buffer-4.1.18.Final.jar
Downloading from central: https://repo.maven.apache.org/maven2/io/netty/netty-common/4.1.18.Final/netty-common-4.1.18.Final.jar
Downloading from central: https://repo.maven.apache.org/maven2/io/netty/netty-resolver/4.1.18.Final/netty-resolver-4.1.18.Final.jar
Progress (1): 2.8/454 kB
Progress (1): 5.5/454 kB
Progress (1): 8.3/454 kB
Progress (1): 11/454 kB 
Progress (1): 14/454 kB
Progress (1): 16/454 kB
Progress (1): 19/454 kB
Progress (1): 22/454 kB
Progress (1): 25/454 kB
Progress (1): 27/454 kB
Progress (1): 30/454 kB
Progress (1): 33/454 kB
Progress (2): 33/454 kB | 2.2/271 kB
Progress (2): 33/454 kB | 5.0/271 kB
Progress (2): 37/454 kB | 5.0/271 kB
Progress (2): 41/454 kB | 5.0/271 kB
Progress (2): 45/454 kB | 5.0/271 kB
Progress (2): 49/454 kB | 5.0/271 kB
Progress (3): 49/454 kB | 5.0/271 kB | 2.2/313 kB
Progress (3): 49/454 kB | 5.0/271 kB | 5.0/313 kB
Progress (3): 53/454 kB | 5.0/271 kB | 5.0/313 kB
Progress (3): 57/454 kB | 5.0/271 kB | 5.0/313 kB
Progress (3): 61/454 kB | 5.0/271 kB | 5.0/313 kB
Progress (3): 65/454 kB | 5.0/271 kB | 5.0/313 kB
Progress (3): 65/454 kB | 5.0/271 kB | 7.7/313 kB
Progress (3): 69/454 kB | 5.0/271 kB | 7.7/313 kB
Progress (3): 73/454 kB | 5.0/271 kB | 7.7/313 kB
Progress (3): 77/454 kB | 5.0/271 kB | 7.7/313 kB
Progress (3): 77/454 kB | 5.0/271 kB | 10/313 kB 
Progress (3): 81/454 kB | 5.0/271 kB | 10/313 kB
Progress (3): 85/454 kB | 5.0/271 kB | 10/313 kB
Progress (3): 90/454 kB | 5.0/271 kB | 10/313 kB
Progress (3): 94/454 kB | 5.0/271 kB | 10/313 kB
Progress (3): 98/454 kB | 5.0/271 kB | 10/313 kB
Progress (4): 98/454 kB | 5.0/271 kB | 10/313 kB | 2.2/567 kB
Progress (4): 102/454 kB | 5.0/271 kB | 10/313 kB | 2.2/567 kB
Progress (4): 106/454 kB | 5.0/271 kB | 10/313 kB | 2.2/567 kB
Progress (4): 110/454 kB | 5.0/271 kB | 10/313 kB | 2.2/567 kB
Progress (4): 114/454 kB | 5.0/271 kB | 10/313 kB | 2.2/567 kB
Progress (4): 114/454 kB | 5.0/271 kB | 10/313 kB | 5.0/567 kB
Progress (4): 118/454 kB | 5.0/271 kB | 10/313 kB | 5.0/567 kB
Progress (4): 122/454 kB | 5.0/271 kB | 10/313 kB | 5.0/567 kB
Progress (4): 126/454 kB | 5.0/271 kB | 10/313 kB | 5.0/567 kB
Progress (4): 130/454 kB | 5.0/271 kB | 10/313 kB | 5.0/567 kB
Progress (4): 135/454 kB | 5.0/271 kB | 10/313 kB | 5.0/567 kB
Progress (4): 139/454 kB | 5.0/271 kB | 10/313 kB | 5.0/567 kB
Progress (4): 143/454 kB | 5.0/271 kB | 10/313 kB | 5.0/567 kB
Progress (4): 147/454 kB | 5.0/271 kB | 10/313 kB | 5.0/567 kB
Progress (4): 151/454 kB | 5.0/271 kB | 10/313 kB | 5.0/567 kB
Progress (4): 155/454 kB | 5.0/271 kB | 10/313 kB | 5.0/567 kB
Progress (4): 159/454 kB | 5.0/271 kB | 10/313 kB | 5.0/567 kB
Progress (4): 163/454 kB | 5.0/271 kB | 10/313 kB | 5.0/567 kB
Progress (4): 167/454 kB | 5.0/271 kB | 10/313 kB | 5.0/567 kB
Progress (4): 171/454 kB | 5.0/271 kB | 10/313 kB | 5.0/567 kB
Progress (4): 176/454 kB | 5.0/271 kB | 10/313 kB | 5.0/567 kB
Progress (4): 180/454 kB | 5.0/271 kB | 10/313 kB | 5.0/567 kB
Progress (4): 184/454 kB | 5.0/271 kB | 10/313 kB | 5.0/567 kB
Progress (4): 188/454 kB | 5.0/271 kB | 10/313 kB | 5.0/567 kB
Progress (4): 192/454 kB | 5.0/271 kB | 10/313 kB | 5.0/567 kB
Progress (4): 196/454 kB | 5.0/271 kB | 10/313 kB | 5.0/567 kB
Progress (4): 200/454 kB | 5.0/271 kB | 10/313 kB | 5.0/567 kB
Progress (4): 204/454 kB | 5.0/271 kB | 10/313 kB | 5.0/567 kB
Progress (4): 208/454 kB | 5.0/271 kB | 10/313 kB | 5.0/567 kB
Progress (4): 212/454 kB | 5.0/271 kB | 10/313 kB | 5.0/567 kB
Progress (4): 217/454 kB | 5.0/271 kB | 10/313 kB | 5.0/567 kB
Progress (4): 221/454 kB | 5.0/271 kB | 10/313 kB | 5.0/567 kB
Progress (4): 225/454 kB | 5.0/271 kB | 10/313 kB | 5.0/567 kB
Progress (4): 229/454 kB | 5.0/271 kB | 10/313 kB | 5.0/567 kB
Progress (4): 233/454 kB | 5.0/271 kB | 10/313 kB | 5.0/567 kB
Progress (4): 237/454 kB | 5.0/271 kB | 10/313 kB | 5.0/567 kB
Progress (4): 241/454 kB | 5.0/271 kB | 10/313 kB | 5.0/567 kB
Progress (4): 245/454 kB | 5.0/271 kB | 10/313 kB | 5.0/567 kB
Progress (4): 249/454 kB | 5.0/271 kB | 10/313 kB | 5.0/567 kB
Progress (4): 249/454 kB | 7.7/271 kB | 10/313 kB | 5.0/567 kB
Progress (4): 253/454 kB | 7.7/271 kB | 10/313 kB | 5.0/567 kB
Progress (4): 253/454 kB | 10/271 kB | 10/313 kB | 5.0/567 kB 
Progress (4): 257/454 kB | 10/271 kB | 10/313 kB | 5.0/567 kB
Progress (4): 257/454 kB | 13/271 kB | 10/313 kB | 5.0/567 kB
Progress (4): 262/454 kB | 13/271 kB | 10/313 kB | 5.0/567 kB
Progress (4): 262/454 kB | 16/271 kB | 10/313 kB | 5.0/567 kB
Progress (4): 262/454 kB | 19/271 kB | 10/313 kB | 5.0/567 kB
Progress (4): 262/454 kB | 21/271 kB | 10/313 kB | 5.0/567 kB
Progress (4): 266/454 kB | 21/271 kB | 10/313 kB | 5.0/567 kB
Progress (4): 270/454 kB | 21/271 kB | 10/313 kB | 5.0/567 kB
Progress (4): 270/454 kB | 24/271 kB | 10/313 kB | 5.0/567 kB
Progress (4): 274/454 kB | 24/271 kB | 10/313 kB | 5.0/567 kB
Progress (4): 278/454 kB | 24/271 kB | 10/313 kB | 5.0/567 kB
Progress (4): 278/454 kB | 27/271 kB | 10/313 kB | 5.0/567 kB
Progress (4): 278/454 kB | 30/271 kB | 10/313 kB | 5.0/567 kB
Progress (4): 278/454 kB | 32/271 kB | 10/313 kB | 5.0/567 kB
Progress (4): 282/454 kB | 32/271 kB | 10/313 kB | 5.0/567 kB
Progress (4): 286/454 kB | 32/271 kB | 10/313 kB | 5.0/567 kB
Progress (4): 290/454 kB | 32/271 kB | 10/313 kB | 5.0/567 kB
Progress (5): 290/454 kB | 32/271 kB | 10/313 kB | 5.0/567 kB | 2.2/32 kB
Progress (5): 294/454 kB | 32/271 kB | 10/313 kB | 5.0/567 kB | 2.2/32 kB
Progress (5): 294/454 kB | 32/271 kB | 10/313 kB | 5.0/567 kB | 5.0/32 kB
Progress (5): 294/454 kB | 32/271 kB | 10/313 kB | 7.7/567 kB | 5.0/32 kB
Progress (5): 294/454 kB | 32/271 kB | 10/313 kB | 7.7/567 kB | 7.7/32 kB
Progress (5): 294/454 kB | 32/271 kB | 10/313 kB | 10/567 kB | 7.7/32 kB 
Progress (5): 294/454 kB | 32/271 kB | 10/313 kB | 10/567 kB | 11/32 kB 
Progress (5): 294/454 kB | 36/271 kB | 10/313 kB | 10/567 kB | 11/32 kB
Progress (5): 294/454 kB | 36/271 kB | 10/313 kB | 10/567 kB | 13/32 kB
Progress (5): 294/454 kB | 36/271 kB | 10/313 kB | 13/567 kB | 13/32 kB
Progress (5): 294/454 kB | 36/271 kB | 10/313 kB | 13/567 kB | 16/32 kB
Progress (5): 298/454 kB | 36/271 kB | 10/313 kB | 13/567 kB | 16/32 kB
Progress (5): 298/454 kB | 36/271 kB | 10/313 kB | 16/567 kB | 16/32 kB
Progress (5): 298/454 kB | 36/271 kB | 10/313 kB | 16/567 kB | 19/32 kB
Progress (5): 298/454 kB | 36/271 kB | 10/313 kB | 19/567 kB | 19/32 kB
Progress (5): 298/454 kB | 36/271 kB | 10/313 kB | 21/567 kB | 19/32 kB
Progress (5): 298/454 kB | 36/271 kB | 10/313 kB | 24/567 kB | 19/32 kB
Progress (5): 298/454 kB | 36/271 kB | 10/313 kB | 27/567 kB | 19/32 kB
Progress (5): 298/454 kB | 36/271 kB | 10/313 kB | 30/567 kB | 19/32 kB
Progress (5): 298/454 kB | 36/271 kB | 10/313 kB | 32/567 kB | 19/32 kB
Progress (5): 298/454 kB | 36/271 kB | 10/313 kB | 36/567 kB | 19/32 kB
Progress (5): 298/454 kB | 36/271 kB | 10/313 kB | 40/567 kB | 19/32 kB
Progress (5): 298/454 kB | 36/271 kB | 10/313 kB | 45/567 kB | 19/32 kB
Progress (5): 298/454 kB | 40/271 kB | 10/313 kB | 45/567 kB | 19/32 kB
Progress (5): 298/454 kB | 45/271 kB | 10/313 kB | 45/567 kB | 19/32 kB
Progress (5): 298/454 kB | 49/271 kB | 10/313 kB | 45/567 kB | 19/32 kB
Progress (5): 298/454 kB | 53/271 kB | 10/313 kB | 45/567 kB | 19/32 kB
Progress (5): 298/454 kB | 57/271 kB | 10/313 kB | 45/567 kB | 19/32 kB
Progress (5): 298/454 kB | 61/271 kB | 10/313 kB | 45/567 kB | 19/32 kB
Progress (5): 298/454 kB | 65/271 kB | 10/313 kB | 45/567 kB | 19/32 kB
Progress (5): 298/454 kB | 69/271 kB | 10/313 kB | 45/567 kB | 19/32 kB
Progress (5): 298/454 kB | 69/271 kB | 10/313 kB | 45/567 kB | 21/32 kB
Progress (5): 303/454 kB | 69/271 kB | 10/313 kB | 45/567 kB | 21/32 kB
Progress (5): 303/454 kB | 73/271 kB | 10/313 kB | 45/567 kB | 21/32 kB
Progress (5): 303/454 kB | 73/271 kB | 10/313 kB | 49/567 kB | 21/32 kB
Progress (5): 303/454 kB | 73/271 kB | 10/313 kB | 49/567 kB | 24/32 kB
Progress (5): 307/454 kB | 73/271 kB | 10/313 kB | 49/567 kB | 24/32 kB
Progress (5): 311/454 kB | 73/271 kB | 10/313 kB | 49/567 kB | 24/32 kB
Progress (5): 311/454 kB | 73/271 kB | 10/313 kB | 49/567 kB | 27/32 kB
Progress (5): 315/454 kB | 73/271 kB | 10/313 kB | 49/567 kB | 27/32 kB
Progress (5): 319/454 kB | 73/271 kB | 10/313 kB | 49/567 kB | 27/32 kB
Progress (5): 319/454 kB | 73/271 kB | 10/313 kB | 49/567 kB | 30/32 kB
Progress (5): 323/454 kB | 73/271 kB | 10/313 kB | 49/567 kB | 30/32 kB
Progress (5): 327/454 kB | 73/271 kB | 10/313 kB | 49/567 kB | 30/32 kB
Progress (5): 327/454 kB | 73/271 kB | 10/313 kB | 53/567 kB | 30/32 kB
Progress (5): 327/454 kB | 73/271 kB | 10/313 kB | 53/567 kB | 32/32 kB
Progress (5): 327/454 kB | 77/271 kB | 10/313 kB | 53/567 kB | 32/32 kB
Progress (5): 327/454 kB | 77/271 kB | 10/313 kB | 53/567 kB | 32 kB   
Progress (5): 331/454 kB | 77/271 kB | 10/313 kB | 53/567 kB | 32 kB
Progress (5): 331/454 kB | 77/271 kB | 10/313 kB | 57/567 kB | 32 kB
Progress (5): 335/454 kB | 77/271 kB | 10/313 kB | 57/567 kB | 32 kB
Progress (5): 335/454 kB | 77/271 kB | 10/313 kB | 61/567 kB | 32 kB
Progress (5): 335/454 kB | 77/271 kB | 10/313 kB | 65/567 kB | 32 kB
Progress (5): 335/454 kB | 77/271 kB | 10/313 kB | 69/567 kB | 32 kB
Progress (5): 335/454 kB | 77/271 kB | 10/313 kB | 73/567 kB | 32 kB
Progress (5): 335/454 kB | 81/271 kB | 10/313 kB | 73/567 kB | 32 kB
Progress (5): 339/454 kB | 81/271 kB | 10/313 kB | 73/567 kB | 32 kB
Progress (5): 343/454 kB | 81/271 kB | 10/313 kB | 73/567 kB | 32 kB
Progress (5): 348/454 kB | 81/271 kB | 10/313 kB | 73/567 kB | 32 kB
Progress (5): 352/454 kB | 81/271 kB | 10/313 kB | 73/567 kB | 32 kB
Progress (5): 356/454 kB | 81/271 kB | 10/313 kB | 73/567 kB | 32 kB
Progress (5): 360/454 kB | 81/271 kB | 10/313 kB | 73/567 kB | 32 kB
Progress (5): 360/454 kB | 85/271 kB | 10/313 kB | 73/567 kB | 32 kB
Progress (5): 360/454 kB | 90/271 kB | 10/313 kB | 73/567 kB | 32 kB
Progress (5): 364/454 kB | 90/271 kB | 10/313 kB | 73/567 kB | 32 kB
Progress (5): 364/454 kB | 90/271 kB | 10/313 kB | 77/567 kB | 32 kB
Progress (5): 368/454 kB | 90/271 kB | 10/313 kB | 77/567 kB | 32 kB
Progress (5): 372/454 kB | 90/271 kB | 10/313 kB | 77/567 kB | 32 kB
Progress (5): 372/454 kB | 94/271 kB | 10/313 kB | 77/567 kB | 32 kB
Progress (5): 376/454 kB | 94/271 kB | 10/313 kB | 77/567 kB | 32 kB
Progress (5): 376/454 kB | 98/271 kB | 10/313 kB | 77/567 kB | 32 kB
Progress (5): 376/454 kB | 98/271 kB | 10/313 kB | 81/567 kB | 32 kB
Progress (5): 380/454 kB | 98/271 kB | 10/313 kB | 81/567 kB | 32 kB
Progress (5): 384/454 kB | 98/271 kB | 10/313 kB | 81/567 kB | 32 kB
Progress (5): 389/454 kB | 98/271 kB | 10/313 kB | 81/567 kB | 32 kB
Progress (5): 393/454 kB | 98/271 kB | 10/313 kB | 81/567 kB | 32 kB
Progress (5): 393/454 kB | 98/271 kB | 10/313 kB | 85/567 kB | 32 kB
Progress (5): 393/454 kB | 98/271 kB | 10/313 kB | 90/567 kB | 32 kB
Progress (5): 397/454 kB | 98/271 kB | 10/313 kB | 90/567 kB | 32 kB
Progress (5): 401/454 kB | 98/271 kB | 10/313 kB | 90/567 kB | 32 kB
Progress (5): 405/454 kB | 98/271 kB | 10/313 kB | 90/567 kB | 32 kB
Progress (5): 409/454 kB | 98/271 kB | 10/313 kB | 90/567 kB | 32 kB
Progress (5): 413/454 kB | 98/271 kB | 10/313 kB | 90/567 kB | 32 kB
Progress (5): 417/454 kB | 98/271 kB | 10/313 kB | 90/567 kB | 32 kB
Progress (5): 417/454 kB | 98/271 kB | 10/313 kB | 94/567 kB | 32 kB
Progress (5): 421/454 kB | 98/271 kB | 10/313 kB | 94/567 kB | 32 kB
Progress (5): 421/454 kB | 98/271 kB | 10/313 kB | 98/567 kB | 32 kB
Progress (5): 425/454 kB | 98/271 kB | 10/313 kB | 98/567 kB | 32 kB
Progress (5): 425/454 kB | 102/271 kB | 10/313 kB | 98/567 kB | 32 kB
Progress (5): 430/454 kB | 102/271 kB | 10/313 kB | 98/567 kB | 32 kB
Progress (5): 430/454 kB | 102/271 kB | 10/313 kB | 102/567 kB | 32 kB
Progress (5): 430/454 kB | 106/271 kB | 10/313 kB | 102/567 kB | 32 kB
Progress (5): 434/454 kB | 106/271 kB | 10/313 kB | 102/567 kB | 32 kB
Progress (5): 434/454 kB | 110/271 kB | 10/313 kB | 102/567 kB | 32 kB
Progress (5): 434/454 kB | 110/271 kB | 10/313 kB | 106/567 kB | 32 kB
Progress (5): 434/454 kB | 114/271 kB | 10/313 kB | 106/567 kB | 32 kB
Progress (5): 438/454 kB | 114/271 kB | 10/313 kB | 106/567 kB | 32 kB
Progress (5): 438/454 kB | 114/271 kB | 10/313 kB | 110/567 kB | 32 kB
Progress (5): 442/454 kB | 114/271 kB | 10/313 kB | 110/567 kB | 32 kB
Progress (5): 442/454 kB | 114/271 kB | 10/313 kB | 114/567 kB | 32 kB
Progress (5): 446/454 kB | 114/271 kB | 10/313 kB | 114/567 kB | 32 kB
Progress (5): 450/454 kB | 114/271 kB | 10/313 kB | 114/567 kB | 32 kB
Progress (5): 454 kB | 114/271 kB | 10/313 kB | 114/567 kB | 32 kB    
Progress (5): 454 kB | 114/271 kB | 10/313 kB | 118/567 kB | 32 kB
Progress (5): 454 kB | 114/271 kB | 10/313 kB | 122/567 kB | 32 kB
Progress (5): 454 kB | 114/271 kB | 10/313 kB | 126/567 kB | 32 kB
Progress (5): 454 kB | 118/271 kB | 10/313 kB | 126/567 kB | 32 kB
Progress (5): 454 kB | 118/271 kB | 10/313 kB | 131/567 kB | 32 kB
Progress (5): 454 kB | 122/271 kB | 10/313 kB | 131/567 kB | 32 kB
Progress (5): 454 kB | 126/271 kB | 10/313 kB | 131/567 kB | 32 kB
Progress (5): 454 kB | 131/271 kB | 10/313 kB | 131/567 kB | 32 kB
Progress (5): 454 kB | 131/271 kB | 10/313 kB | 135/567 kB | 32 kB
Progress (5): 454 kB | 131/271 kB | 10/313 kB | 139/567 kB | 32 kB
Progress (5): 454 kB | 131/271 kB | 10/313 kB | 143/567 kB | 32 kB
Progress (5): 454 kB | 131/271 kB | 10/313 kB | 147/567 kB | 32 kB
Progress (5): 454 kB | 131/271 kB | 10/313 kB | 151/567 kB | 32 kB
Progress (5): 454 kB | 135/271 kB | 10/313 kB | 151/567 kB | 32 kB
Progress (5): 454 kB | 135/271 kB | 10/313 kB | 155/567 kB | 32 kB
Progress (5): 454 kB | 139/271 kB | 10/313 kB | 155/567 kB | 32 kB
Progress (5): 454 kB | 139/271 kB | 10/313 kB | 159/567 kB | 32 kB
Progress (5): 454 kB | 143/271 kB | 10/313 kB | 159/567 kB | 32 kB
Progress (5): 454 kB | 143/271 kB | 10/313 kB | 163/567 kB | 32 kB
Progress (5): 454 kB | 147/271 kB | 10/313 kB | 163/567 kB | 32 kB
Progress (5): 454 kB | 147/271 kB | 10/313 kB | 167/567 kB | 32 kB
Progress (5): 454 kB | 147/271 kB | 10/313 kB | 171/567 kB | 32 kB
Progress (5): 454 kB | 147/271 kB | 10/313 kB | 176/567 kB | 32 kB
Progress (5): 454 kB | 147/271 kB | 10/313 kB | 180/567 kB | 32 kB
Progress (5): 454 kB | 151/271 kB | 10/313 kB | 180/567 kB | 32 kB
Progress (5): 454 kB | 155/271 kB | 10/313 kB | 180/567 kB | 32 kB
Progress (5): 454 kB | 159/271 kB | 10/313 kB | 180/567 kB | 32 kB
Progress (5): 454 kB | 159/271 kB | 10/313 kB | 184/567 kB | 32 kB
Progress (5): 454 kB | 163/271 kB | 10/313 kB | 184/567 kB | 32 kB
Progress (5): 454 kB | 163/271 kB | 10/313 kB | 188/567 kB | 32 kB
Progress (5): 454 kB | 163/271 kB | 10/313 kB | 192/567 kB | 32 kB
Progress (5): 454 kB | 163/271 kB | 10/313 kB | 196/567 kB | 32 kB
Progress (5): 454 kB | 163/271 kB | 13/313 kB | 196/567 kB | 32 kB
Progress (5): 454 kB | 167/271 kB | 13/313 kB | 196/567 kB | 32 kB
Progress (5): 454 kB | 167/271 kB | 16/313 kB | 196/567 kB | 32 kB
Progress (5): 454 kB | 167/271 kB | 16/313 kB | 200/567 kB | 32 kB
Progress (5): 454 kB | 167/271 kB | 16/313 kB | 204/567 kB | 32 kB
Progress (5): 454 kB | 167/271 kB | 19/313 kB | 204/567 kB | 32 kB
Progress (5): 454 kB | 167/271 kB | 19/313 kB | 208/567 kB | 32 kB
Progress (5): 454 kB | 167/271 kB | 21/313 kB | 208/567 kB | 32 kB
Progress (5): 454 kB | 171/271 kB | 21/313 kB | 208/567 kB | 32 kB
Progress (5): 454 kB | 176/271 kB | 21/313 kB | 208/567 kB | 32 kB
                                                                  
Downloaded from central: https://repo.maven.apache.org/maven2/io/netty/netty-resolver/4.1.18.Final/netty-resolver-4.1.18.Final.jar (32 kB at 183 kB/s)
Progress (4): 454 kB | 176/271 kB | 24/313 kB | 208/567 kB
Progress (4): 454 kB | 176/271 kB | 24/313 kB | 212/567 kB
Progress (4): 454 kB | 176/271 kB | 27/313 kB | 212/567 kB
Progress (4): 454 kB | 180/271 kB | 27/313 kB | 212/567 kB
Progress (4): 454 kB | 180/271 kB | 30/313 kB | 212/567 kB
Progress (4): 454 kB | 180/271 kB | 32/313 kB | 212/567 kB
Progress (4): 454 kB | 180/271 kB | 32/313 kB | 217/567 kB
Progress (4): 454 kB | 184/271 kB | 32/313 kB | 217/567 kB
Progress (4): 454 kB | 184/271 kB | 36/313 kB | 217/567 kB
Progress (4): 454 kB | 188/271 kB | 36/313 kB | 217/567 kB
Progress (4): 454 kB | 188/271 kB | 40/313 kB | 217/567 kB
Progress (4): 454 kB | 188/271 kB | 40/313 kB | 221/567 kB
Progress (4): 454 kB | 188/271 kB | 45/313 kB | 221/567 kB
Progress (4): 454 kB | 192/271 kB | 45/313 kB | 221/567 kB
Progress (4): 454 kB | 192/271 kB | 49/313 kB | 221/567 kB
Progress (4): 454 kB | 192/271 kB | 49/313 kB | 225/567 kB
Progress (4): 454 kB | 192/271 kB | 49/313 kB | 229/567 kB
Progress (4): 454 kB | 196/271 kB | 49/313 kB | 229/567 kB
Progress (4): 454 kB | 196/271 kB | 53/313 kB | 229/567 kB
Progress (4): 454 kB | 196/271 kB | 57/313 kB | 229/567 kB
Progress (4): 454 kB | 196/271 kB | 61/313 kB | 229/567 kB
Progress (4): 454 kB | 196/271 kB | 65/313 kB | 229/567 kB
Progress (4): 454 kB | 196/271 kB | 65/313 kB | 233/567 kB
Progress (4): 454 kB | 196/271 kB | 65/313 kB | 237/567 kB
Progress (4): 454 kB | 196/271 kB | 69/313 kB | 237/567 kB
Progress (4): 454 kB | 200/271 kB | 69/313 kB | 237/567 kB
Progress (4): 454 kB | 200/271 kB | 73/313 kB | 237/567 kB
Progress (4): 454 kB | 204/271 kB | 73/313 kB | 237/567 kB
Progress (4): 454 kB | 204/271 kB | 73/313 kB | 241/567 kB
Progress (4): 454 kB | 208/271 kB | 73/313 kB | 241/567 kB
Progress (4): 454 kB | 208/271 kB | 77/313 kB | 241/567 kB
Progress (4): 454 kB | 212/271 kB | 77/313 kB | 241/567 kB
Progress (4): 454 kB | 212/271 kB | 77/313 kB | 245/567 kB
Progress (4): 454 kB | 212/271 kB | 81/313 kB | 245/567 kB
Progress (4): 454 kB | 212/271 kB | 85/313 kB | 245/567 kB
Progress (4): 454 kB | 217/271 kB | 85/313 kB | 245/567 kB
Progress (4): 454 kB | 217/271 kB | 85/313 kB | 249/567 kB
Progress (4): 454 kB | 221/271 kB | 85/313 kB | 249/567 kB
Progress (4): 454 kB | 221/271 kB | 90/313 kB | 249/567 kB
Progress (4): 454 kB | 225/271 kB | 90/313 kB | 249/567 kB
Progress (4): 454 kB | 225/271 kB | 90/313 kB | 253/567 kB
Progress (4): 454 kB | 229/271 kB | 90/313 kB | 253/567 kB
Progress (4): 454 kB | 229/271 kB | 94/313 kB | 253/567 kB
Progress (4): 454 kB | 229/271 kB | 94/313 kB | 258/567 kB
Progress (4): 454 kB | 229/271 kB | 98/313 kB | 258/567 kB
Progress (4): 454 kB | 229/271 kB | 98/313 kB | 262/567 kB
Progress (4): 454 kB | 233/271 kB | 98/313 kB | 262/567 kB
Progress (4): 454 kB | 233/271 kB | 102/313 kB | 262/567 kB
Progress (4): 454 kB | 237/271 kB | 102/313 kB | 262/567 kB
Progress (4): 454 kB | 237/271 kB | 106/313 kB | 262/567 kB
Progress (4): 454 kB | 237/271 kB | 106/313 kB | 266/567 kB
Progress (4): 454 kB | 237/271 kB | 110/313 kB | 266/567 kB
Progress (4): 454 kB | 241/271 kB | 110/313 kB | 266/567 kB
Progress (4): 454 kB | 241/271 kB | 114/313 kB | 266/567 kB
Progress (4): 454 kB | 245/271 kB | 114/313 kB | 266/567 kB
Progress (4): 454 kB | 245/271 kB | 114/313 kB | 270/567 kB
Progress (4): 454 kB | 245/271 kB | 114/313 kB | 274/567 kB
Progress (4): 454 kB | 245/271 kB | 114/313 kB | 278/567 kB
Progress (4): 454 kB | 245/271 kB | 118/313 kB | 278/567 kB
Progress (4): 454 kB | 245/271 kB | 122/313 kB | 278/567 kB
Progress (4): 454 kB | 245/271 kB | 126/313 kB | 278/567 kB
Progress (4): 454 kB | 245/271 kB | 131/313 kB | 278/567 kB
Progress (4): 454 kB | 249/271 kB | 131/313 kB | 278/567 kB
Progress (4): 454 kB | 253/271 kB | 131/313 kB | 278/567 kB
Progress (4): 454 kB | 253/271 kB | 131/313 kB | 282/567 kB
Progress (4): 454 kB | 258/271 kB | 131/313 kB | 282/567 kB
Progress (4): 454 kB | 258/271 kB | 131/313 kB | 286/567 kB
Progress (4): 454 kB | 262/271 kB | 131/313 kB | 286/567 kB
Progress (4): 454 kB | 266/271 kB | 131/313 kB | 286/567 kB
Progress (4): 454 kB | 270/271 kB | 131/313 kB | 286/567 kB
Progress (4): 454 kB | 270/271 kB | 135/313 kB | 286/567 kB
Progress (4): 454 kB | 271 kB | 135/313 kB | 286/567 kB    
                                                       
Downloaded from central: https://repo.maven.apache.org/maven2/io/netty/netty-transport/4.1.18.Final/netty-transport-4.1.18.Final.jar (454 kB at 2.3 MB/s)
Progress (3): 271 kB | 135/313 kB | 290/567 kB
Progress (3): 271 kB | 139/313 kB | 290/567 kB
Progress (3): 271 kB | 139/313 kB | 294/567 kB
Progress (3): 271 kB | 143/313 kB | 294/567 kB
Progress (3): 271 kB | 147/313 kB | 294/567 kB
Progress (3): 271 kB | 147/313 kB | 298/567 kB
Progress (3): 271 kB | 151/313 kB | 298/567 kB
Progress (3): 271 kB | 151/313 kB | 303/567 kB
Progress (3): 271 kB | 155/313 kB | 303/567 kB
Progress (3): 271 kB | 155/313 kB | 307/567 kB
Progress (3): 271 kB | 159/313 kB | 307/567 kB
Progress (3): 271 kB | 159/313 kB | 311/567 kB
Progress (3): 271 kB | 163/313 kB | 311/567 kB
Progress (3): 271 kB | 167/313 kB | 311/567 kB
Progress (3): 271 kB | 167/313 kB | 315/567 kB
Progress (3): 271 kB | 171/313 kB | 315/567 kB
Progress (3): 271 kB | 171/313 kB | 319/567 kB
Progress (3): 271 kB | 176/313 kB | 319/567 kB
Progress (3): 271 kB | 176/313 kB | 323/567 kB
Progress (3): 271 kB | 180/313 kB | 323/567 kB
Progress (3): 271 kB | 180/313 kB | 327/567 kB
Progress (3): 271 kB | 184/313 kB | 327/567 kB
Progress (3): 271 kB | 188/313 kB | 327/567 kB
Progress (3): 271 kB | 192/313 kB | 327/567 kB
Progress (3): 271 kB | 192/313 kB | 331/567 kB
Progress (3): 271 kB | 196/313 kB | 331/567 kB
Progress (3): 271 kB | 196/313 kB | 335/567 kB
Progress (3): 271 kB | 196/313 kB | 339/567 kB
Progress (3): 271 kB | 196/313 kB | 344/567 kB
Progress (3): 271 kB | 200/313 kB | 344/567 kB
Progress (3): 271 kB | 204/313 kB | 344/567 kB
Progress (3): 271 kB | 208/313 kB | 344/567 kB
Progress (3): 271 kB | 212/313 kB | 344/567 kB
Progress (3): 271 kB | 212/313 kB | 348/567 kB
Progress (3): 271 kB | 212/313 kB | 352/567 kB
Progress (3): 271 kB | 212/313 kB | 356/567 kB
Progress (3): 271 kB | 217/313 kB | 356/567 kB
Progress (3): 271 kB | 217/313 kB | 360/567 kB
Progress (3): 271 kB | 221/313 kB | 360/567 kB
Progress (3): 271 kB | 225/313 kB | 360/567 kB
Progress (3): 271 kB | 229/313 kB | 360/567 kB
Progress (3): 271 kB | 229/313 kB | 364/567 kB
Progress (3): 271 kB | 233/313 kB | 364/567 kB
Progress (3): 271 kB | 233/313 kB | 368/567 kB
Progress (3): 271 kB | 237/313 kB | 368/567 kB
Progress (3): 271 kB | 237/313 kB | 372/567 kB
Progress (3): 271 kB | 241/313 kB | 372/567 kB
Progress (3): 271 kB | 241/313 kB | 376/567 kB
Progress (3): 271 kB | 245/313 kB | 376/567 kB
Progress (3): 271 kB | 249/313 kB | 376/567 kB
Progress (3): 271 kB | 249/313 kB | 380/567 kB
Progress (3): 271 kB | 253/313 kB | 380/567 kB
Progress (3): 271 kB | 253/313 kB | 384/567 kB
Progress (3): 271 kB | 258/313 kB | 384/567 kB
Progress (3): 271 kB | 258/313 kB | 389/567 kB
Progress (3): 271 kB | 262/313 kB | 389/567 kB
Progress (3): 271 kB | 262/313 kB | 393/567 kB
Progress (3): 271 kB | 266/313 kB | 393/567 kB
Progress (3): 271 kB | 270/313 kB | 393/567 kB
Progress (3): 271 kB | 274/313 kB | 393/567 kB
Progress (3): 271 kB | 274/313 kB | 397/567 kB
Progress (3): 271 kB | 278/313 kB | 397/567 kB
Progress (3): 271 kB | 278/313 kB | 401/567 kB
Progress (3): 271 kB | 278/313 kB | 405/567 kB
Progress (3): 271 kB | 278/313 kB | 409/567 kB
Progress (3): 271 kB | 282/313 kB | 409/567 kB
Progress (3): 271 kB | 286/313 kB | 409/567 kB
Progress (3): 271 kB | 290/313 kB | 409/567 kB
Progress (3): 271 kB | 294/313 kB | 409/567 kB
Progress (3): 271 kB | 294/313 kB | 413/567 kB
Progress (3): 271 kB | 294/313 kB | 417/567 kB
Progress (3): 271 kB | 294/313 kB | 421/567 kB
Progress (3): 271 kB | 298/313 kB | 421/567 kB
Progress (3): 271 kB | 298/313 kB | 425/567 kB
Progress (3): 271 kB | 303/313 kB | 425/567 kB
Progress (3): 271 kB | 307/313 kB | 425/567 kB
Progress (3): 271 kB | 311/313 kB | 425/567 kB
Progress (3): 271 kB | 313 kB | 425/567 kB    
Progress (3): 271 kB | 313 kB | 430/567 kB
Progress (3): 271 kB | 313 kB | 434/567 kB
Progress (3): 271 kB | 313 kB | 438/567 kB
Progress (3): 271 kB | 313 kB | 442/567 kB
Progress (3): 271 kB | 313 kB | 446/567 kB
Progress (3): 271 kB | 313 kB | 450/567 kB
Progress (3): 271 kB | 313 kB | 454/567 kB
Progress (3): 271 kB | 313 kB | 458/567 kB
Progress (3): 271 kB | 313 kB | 462/567 kB
Progress (3): 271 kB | 313 kB | 466/567 kB
Progress (3): 271 kB | 313 kB | 471/567 kB
Progress (3): 271 kB | 313 kB | 475/567 kB
Progress (3): 271 kB | 313 kB | 479/567 kB
Progress (3): 271 kB | 313 kB | 483/567 kB
Progress (3): 271 kB | 313 kB | 487/567 kB
Progress (3): 271 kB | 313 kB | 491/567 kB
Progress (3): 271 kB | 313 kB | 495/567 kB
Progress (3): 271 kB | 313 kB | 499/567 kB
Progress (3): 271 kB | 313 kB | 503/567 kB
Progress (3): 271 kB | 313 kB | 507/567 kB
Progress (3): 271 kB | 313 kB | 511/567 kB
Progress (3): 271 kB | 313 kB | 516/567 kB
Progress (3): 271 kB | 313 kB | 520/567 kB
Progress (3): 271 kB | 313 kB | 524/567 kB
Progress (3): 271 kB | 313 kB | 528/567 kB
Progress (3): 271 kB | 313 kB | 532/567 kB
Progress (3): 271 kB | 313 kB | 536/567 kB
Progress (3): 271 kB | 313 kB | 540/567 kB
Progress (3): 271 kB | 313 kB | 544/567 kB
Progress (3): 271 kB | 313 kB | 548/567 kB
Progress (3): 271 kB | 313 kB | 552/567 kB
Progress (3): 271 kB | 313 kB | 557/567 kB
Progress (3): 271 kB | 313 kB | 561/567 kB
Progress (3): 271 kB | 313 kB | 565/567 kB
Progress (3): 271 kB | 313 kB | 567 kB    
                                      
Downloaded from central: https://repo.maven.apache.org/maven2/io/netty/netty-buffer/4.1.18.Final/netty-buffer-4.1.18.Final.jar (271 kB at 1.2 MB/s)
Downloaded from central: https://repo.maven.apache.org/maven2/io/netty/netty-codec/4.1.18.Final/netty-codec-4.1.18.Final.jar (313 kB at 1.3 MB/s)
Downloaded from central: https://repo.maven.apache.org/maven2/io/netty/netty-common/4.1.18.Final/netty-common-4.1.18.Final.jar (567 kB at 2.3 MB/s)
[INFO] 
[INFO] --- maven-clean-plugin:2.5:clean (default-clean) @ bungeecord-protocol ---
[INFO] 
[INFO] --- scriptus:0.3.1:describe (default) @ bungeecord-protocol ---
[INFO] Set property "describe" to "git:BungeeCord-Protocol:1.12-SNAPSHOT:aadfe0b:unknown"
[INFO] 
[INFO] --- maven-resources-plugin:2.6:resources (default-resources) @ bungeecord-protocol ---
[INFO] Using 'UTF-8' encoding to copy filtered resources.
[INFO] skip non existing resourceDirectory /home/jenkins/workspace/Bungeecord 1.7.10 Patch/BungeeCord/protocol/src/main/resources
[INFO] 
[INFO] --- maven-compiler-plugin:3.1:compile (default-compile) @ bungeecord-protocol ---
[INFO] Changes detected - recompiling the module!
[INFO] Compiling 44 source files to /home/jenkins/workspace/Bungeecord 1.7.10 Patch/BungeeCord/protocol/target/classes
[INFO] 
[INFO] --- animal-sniffer-maven-plugin:1.16:check (default) @ bungeecord-protocol ---
[INFO] Checking unresolved references to org.codehaus.mojo.signature:java17:1.0
[INFO] 
[INFO] --- maven-resources-plugin:2.6:testResources (default-testResources) @ bungeecord-protocol ---
[INFO] Using 'UTF-8' encoding to copy filtered resources.
[INFO] skip non existing resourceDirectory /home/jenkins/workspace/Bungeecord 1.7.10 Patch/BungeeCord/protocol/src/test/resources
[INFO] 
[INFO] --- maven-compiler-plugin:3.1:testCompile (default-testCompile) @ bungeecord-protocol ---
[INFO] No sources to compile
[INFO] 
[INFO] --- maven-surefire-plugin:2.12.4:test (default-test) @ bungeecord-protocol ---
[INFO] No tests to run.
[INFO] 
[INFO] --- maven-jar-plugin:2.4:jar (default-jar) @ bungeecord-protocol ---
[INFO] Building jar: /home/jenkins/workspace/Bungeecord 1.7.10 Patch/BungeeCord/protocol/target/bungeecord-protocol-1.12-SNAPSHOT.jar
[INFO] 
[INFO] --- maven-install-plugin:2.4:install (default-install) @ bungeecord-protocol ---
[INFO] Installing /home/jenkins/workspace/Bungeecord 1.7.10 Patch/BungeeCord/protocol/target/bungeecord-protocol-1.12-SNAPSHOT.jar to /home/jenkins/.m2/repository/net/md-5/bungeecord-protocol/1.12-SNAPSHOT/bungeecord-protocol-1.12-SNAPSHOT.jar
[INFO] Installing /home/jenkins/workspace/Bungeecord 1.7.10 Patch/BungeeCord/protocol/pom.xml to /home/jenkins/.m2/repository/net/md-5/bungeecord-protocol/1.12-SNAPSHOT/bungeecord-protocol-1.12-SNAPSHOT.pom
[INFO] 
[INFO] ----------------------< net.md-5:bungeecord-api >-----------------------
[INFO] Building BungeeCord-API 1.12-SNAPSHOT                             [6/18]
[INFO] --------------------------------[ jar ]---------------------------------
[INFO] 
[INFO] --- maven-clean-plugin:2.5:clean (default-clean) @ bungeecord-api ---
[INFO] 
[INFO] --- scriptus:0.3.1:describe (default) @ bungeecord-api ---
[INFO] Set property "describe" to "git:BungeeCord-API:1.12-SNAPSHOT:aadfe0b:unknown"
[INFO] 
[INFO] --- maven-resources-plugin:2.6:resources (default-resources) @ bungeecord-api ---
[INFO] Using 'UTF-8' encoding to copy filtered resources.
[INFO] skip non existing resourceDirectory /home/jenkins/workspace/Bungeecord 1.7.10 Patch/BungeeCord/api/src/main/resources
[INFO] 
[INFO] --- maven-compiler-plugin:3.1:compile (default-compile) @ bungeecord-api ---
[INFO] Changes detected - recompiling the module!
[INFO] Compiling 60 source files to /home/jenkins/workspace/Bungeecord 1.7.10 Patch/BungeeCord/api/target/classes
[WARNING] /home/jenkins/workspace/Bungeecord 1.7.10 Patch/BungeeCord/api/src/main/java/net/md_5/bungee/api/ProxyServer.java: Some input files use or override a deprecated API.
[WARNING] /home/jenkins/workspace/Bungeecord 1.7.10 Patch/BungeeCord/api/src/main/java/net/md_5/bungee/api/ProxyServer.java: Recompile with -Xlint:deprecation for details.
[WARNING] /home/jenkins/workspace/Bungeecord 1.7.10 Patch/BungeeCord/api/src/main/java/net/md_5/bungee/util/CaseInsensitiveMap.java: Some input files use unchecked or unsafe operations.
[WARNING] /home/jenkins/workspace/Bungeecord 1.7.10 Patch/BungeeCord/api/src/main/java/net/md_5/bungee/util/CaseInsensitiveMap.java: Recompile with -Xlint:unchecked for details.
[INFO] 
[INFO] --- animal-sniffer-maven-plugin:1.16:check (default) @ bungeecord-api ---
[INFO] Checking unresolved references to org.codehaus.mojo.signature:java17:1.0
[INFO] 
[INFO] --- maven-resources-plugin:2.6:testResources (default-testResources) @ bungeecord-api ---
[INFO] Using 'UTF-8' encoding to copy filtered resources.
[INFO] skip non existing resourceDirectory /home/jenkins/workspace/Bungeecord 1.7.10 Patch/BungeeCord/api/src/test/resources
[INFO] 
[INFO] --- maven-compiler-plugin:3.1:testCompile (default-testCompile) @ bungeecord-api ---
[INFO] Changes detected - recompiling the module!
[INFO] Compiling 2 source files to /home/jenkins/workspace/Bungeecord 1.7.10 Patch/BungeeCord/api/target/test-classes
[INFO] 
[INFO] --- maven-surefire-plugin:2.12.4:test (default-test) @ bungeecord-api ---
[INFO] Surefire report directory: /home/jenkins/workspace/Bungeecord 1.7.10 Patch/BungeeCord/api/target/surefire-reports

-------------------------------------------------------
 T E S T S
-------------------------------------------------------
Running net.md_5.bungee.util.AddressParseTest
Tests run: 8, Failures: 0, Errors: 0, Skipped: 0, Time elapsed: 0.065 sec
Running net.md_5.bungee.util.CaseInsensitiveTest
Tests run: 2, Failures: 0, Errors: 0, Skipped: 0, Time elapsed: 0.01 sec

Results :

Tests run: 10, Failures: 0, Errors: 0, Skipped: 0

[INFO] 
[INFO] --- maven-jar-plugin:2.4:jar (default-jar) @ bungeecord-api ---
[INFO] Building jar: /home/jenkins/workspace/Bungeecord 1.7.10 Patch/BungeeCord/api/target/bungeecord-api-1.12-SNAPSHOT.jar
[INFO] 
[INFO] --- maven-install-plugin:2.4:install (default-install) @ bungeecord-api ---
[INFO] Installing /home/jenkins/workspace/Bungeecord 1.7.10 Patch/BungeeCord/api/target/bungeecord-api-1.12-SNAPSHOT.jar to /home/jenkins/.m2/repository/net/md-5/bungeecord-api/1.12-SNAPSHOT/bungeecord-api-1.12-SNAPSHOT.jar
[INFO] Installing /home/jenkins/workspace/Bungeecord 1.7.10 Patch/BungeeCord/api/pom.xml to /home/jenkins/.m2/repository/net/md-5/bungeecord-api/1.12-SNAPSHOT/bungeecord-api-1.12-SNAPSHOT.pom
[INFO] 
[INFO] ----------------------< net.md-5:bungeecord-log >-----------------------
[INFO] Building BungeeCord-Log 1.12-SNAPSHOT                             [7/18]
[INFO] --------------------------------[ jar ]---------------------------------
[INFO] 
[INFO] --- maven-clean-plugin:2.5:clean (default-clean) @ bungeecord-log ---
[INFO] 
[INFO] --- scriptus:0.3.1:describe (default) @ bungeecord-log ---
[INFO] Set property "describe" to "git:BungeeCord-Log:1.12-SNAPSHOT:aadfe0b:unknown"
[INFO] 
[INFO] --- maven-resources-plugin:2.6:resources (default-resources) @ bungeecord-log ---
[INFO] Using 'UTF-8' encoding to copy filtered resources.
[INFO] skip non existing resourceDirectory /home/jenkins/workspace/Bungeecord 1.7.10 Patch/BungeeCord/log/src/main/resources
[INFO] 
[INFO] --- maven-compiler-plugin:3.1:compile (default-compile) @ bungeecord-log ---
[INFO] Changes detected - recompiling the module!
[INFO] Compiling 5 source files to /home/jenkins/workspace/Bungeecord 1.7.10 Patch/BungeeCord/log/target/classes
[INFO] 
[INFO] --- animal-sniffer-maven-plugin:1.16:check (default) @ bungeecord-log ---
[INFO] Checking unresolved references to org.codehaus.mojo.signature:java17:1.0
[INFO] 
[INFO] --- maven-resources-plugin:2.6:testResources (default-testResources) @ bungeecord-log ---
[INFO] Using 'UTF-8' encoding to copy filtered resources.
[INFO] skip non existing resourceDirectory /home/jenkins/workspace/Bungeecord 1.7.10 Patch/BungeeCord/log/src/test/resources
[INFO] 
[INFO] --- maven-compiler-plugin:3.1:testCompile (default-testCompile) @ bungeecord-log ---
[INFO] No sources to compile
[INFO] 
[INFO] --- maven-surefire-plugin:2.12.4:test (default-test) @ bungeecord-log ---
[INFO] No tests to run.
[INFO] 
[INFO] --- maven-jar-plugin:2.4:jar (default-jar) @ bungeecord-log ---
[INFO] Building jar: /home/jenkins/workspace/Bungeecord 1.7.10 Patch/BungeeCord/log/target/bungeecord-log-1.12-SNAPSHOT.jar
[INFO] 
[INFO] --- maven-install-plugin:2.4:install (default-install) @ bungeecord-log ---
[INFO] Installing /home/jenkins/workspace/Bungeecord 1.7.10 Patch/BungeeCord/log/target/bungeecord-log-1.12-SNAPSHOT.jar to /home/jenkins/.m2/repository/net/md-5/bungeecord-log/1.12-SNAPSHOT/bungeecord-log-1.12-SNAPSHOT.jar
[INFO] Installing /home/jenkins/workspace/Bungeecord 1.7.10 Patch/BungeeCord/log/pom.xml to /home/jenkins/.m2/repository/net/md-5/bungeecord-log/1.12-SNAPSHOT/bungeecord-log-1.12-SNAPSHOT.pom
[INFO] 
[INFO] ---------------------< net.md-5:bungeecord-native >---------------------
[INFO] Building BungeeCord-Native 1.12-SNAPSHOT                          [8/18]
[INFO] --------------------------------[ jar ]---------------------------------
[INFO] 
[INFO] --- maven-clean-plugin:2.5:clean (default-clean) @ bungeecord-native ---
[INFO] 
[INFO] --- scriptus:0.3.1:describe (default) @ bungeecord-native ---
[INFO] Set property "describe" to "git:BungeeCord-Native:1.12-SNAPSHOT:aadfe0b:unknown"
[INFO] 
[INFO] --- maven-resources-plugin:2.6:resources (default-resources) @ bungeecord-native ---
[INFO] Using 'UTF-8' encoding to copy filtered resources.
[INFO] Copying 2 resources
[INFO] 
[INFO] --- maven-compiler-plugin:3.1:compile (default-compile) @ bungeecord-native ---
[INFO] Changes detected - recompiling the module!
[INFO] Compiling 10 source files to /home/jenkins/workspace/Bungeecord 1.7.10 Patch/BungeeCord/native/target/classes
[INFO] 
[INFO] --- animal-sniffer-maven-plugin:1.16:check (default) @ bungeecord-native ---
[INFO] Checking unresolved references to org.codehaus.mojo.signature:java17:1.0
[INFO] 
[INFO] --- maven-resources-plugin:2.6:testResources (default-testResources) @ bungeecord-native ---
[INFO] Using 'UTF-8' encoding to copy filtered resources.
[INFO] skip non existing resourceDirectory /home/jenkins/workspace/Bungeecord 1.7.10 Patch/BungeeCord/native/src/test/resources
[INFO] 
[INFO] --- maven-compiler-plugin:3.1:testCompile (default-testCompile) @ bungeecord-native ---
[INFO] Changes detected - recompiling the module!
[INFO] Compiling 2 source files to /home/jenkins/workspace/Bungeecord 1.7.10 Patch/BungeeCord/native/target/test-classes
[INFO] 
[INFO] --- maven-surefire-plugin:2.12.4:test (default-test) @ bungeecord-native ---
[INFO] Surefire report directory: /home/jenkins/workspace/Bungeecord 1.7.10 Patch/BungeeCord/native/target/surefire-reports

-------------------------------------------------------
 T E S T S
-------------------------------------------------------
Running net.md_5.bungee.NativeCipherTest
Testing Java cipher...
This cipher works correctly!
Benchmarking Java cipher...
Encryption Iteration: 4096, Elapsed: 2946 ms
Decryption Iteration: 4096, Elapsed: 2930 ms
Testing native cipher...
This cipher works correctly!
Benchmarking native cipher...
Encryption Iteration: 4096, Elapsed: 1519 ms
Decryption Iteration: 4096, Elapsed: 1502 ms
Tests run: 4, Failures: 0, Errors: 0, Skipped: 0, Time elapsed: 9.352 sec
Running net.md_5.bungee.NativeZlibTest
Testing: net.md_5.bungee.jni.zlib.NativeZlib@2db7a79b
Took: 312ms
Testing: net.md_5.bungee.jni.zlib.JavaZlib@6950e31
Took: 302ms
Tests run: 1, Failures: 0, Errors: 0, Skipped: 0, Time elapsed: 0.639 sec

Results :

Tests run: 5, Failures: 0, Errors: 0, Skipped: 0

[INFO] 
[INFO] --- maven-jar-plugin:2.4:jar (default-jar) @ bungeecord-native ---
[INFO] Building jar: /home/jenkins/workspace/Bungeecord 1.7.10 Patch/BungeeCord/native/target/bungeecord-native-1.12-SNAPSHOT.jar
[INFO] 
[INFO] --- maven-install-plugin:2.4:install (default-install) @ bungeecord-native ---
[INFO] Installing /home/jenkins/workspace/Bungeecord 1.7.10 Patch/BungeeCord/native/target/bungeecord-native-1.12-SNAPSHOT.jar to /home/jenkins/.m2/repository/net/md-5/bungeecord-native/1.12-SNAPSHOT/bungeecord-native-1.12-SNAPSHOT.jar
[INFO] Installing /home/jenkins/workspace/Bungeecord 1.7.10 Patch/BungeeCord/native/pom.xml to /home/jenkins/.m2/repository/net/md-5/bungeecord-native/1.12-SNAPSHOT/bungeecord-native-1.12-SNAPSHOT.pom
[INFO] 
[INFO] ---------------------< net.md-5:bungeecord-query >----------------------
[INFO] Building BungeeCord-Query 1.12-SNAPSHOT                           [9/18]
[INFO] --------------------------------[ jar ]---------------------------------
[INFO] 
[INFO] --- maven-clean-plugin:2.5:clean (default-clean) @ bungeecord-query ---
[INFO] 
[INFO] --- scriptus:0.3.1:describe (default) @ bungeecord-query ---
[INFO] Set property "describe" to "git:BungeeCord-Query:1.12-SNAPSHOT:aadfe0b:unknown"
[INFO] 
[INFO] --- maven-resources-plugin:2.6:resources (default-resources) @ bungeecord-query ---
[INFO] Using 'UTF-8' encoding to copy filtered resources.
[INFO] skip non existing resourceDirectory /home/jenkins/workspace/Bungeecord 1.7.10 Patch/BungeeCord/query/src/main/resources
[INFO] 
[INFO] --- maven-compiler-plugin:3.1:compile (default-compile) @ bungeecord-query ---
[INFO] Changes detected - recompiling the module!
[INFO] Compiling 2 source files to /home/jenkins/workspace/Bungeecord 1.7.10 Patch/BungeeCord/query/target/classes
[WARNING] /home/jenkins/workspace/Bungeecord 1.7.10 Patch/BungeeCord/query/src/main/java/net/md_5/bungee/query/QueryHandler.java: /home/jenkins/workspace/Bungeecord 1.7.10 Patch/BungeeCord/query/src/main/java/net/md_5/bungee/query/QueryHandler.java uses or overrides a deprecated API.
[WARNING] /home/jenkins/workspace/Bungeecord 1.7.10 Patch/BungeeCord/query/src/main/java/net/md_5/bungee/query/QueryHandler.java: Recompile with -Xlint:deprecation for details.
[INFO] 
[INFO] --- animal-sniffer-maven-plugin:1.16:check (default) @ bungeecord-query ---
[INFO] Checking unresolved references to org.codehaus.mojo.signature:java17:1.0
[INFO] 
[INFO] --- maven-resources-plugin:2.6:testResources (default-testResources) @ bungeecord-query ---
[INFO] Using 'UTF-8' encoding to copy filtered resources.
[INFO] skip non existing resourceDirectory /home/jenkins/workspace/Bungeecord 1.7.10 Patch/BungeeCord/query/src/test/resources
[INFO] 
[INFO] --- maven-compiler-plugin:3.1:testCompile (default-testCompile) @ bungeecord-query ---
[INFO] No sources to compile
[INFO] 
[INFO] --- maven-surefire-plugin:2.12.4:test (default-test) @ bungeecord-query ---
[INFO] No tests to run.
[INFO] 
[INFO] --- maven-jar-plugin:2.4:jar (default-jar) @ bungeecord-query ---
[INFO] Building jar: /home/jenkins/workspace/Bungeecord 1.7.10 Patch/BungeeCord/query/target/bungeecord-query-1.12-SNAPSHOT.jar
[INFO] 
[INFO] --- maven-install-plugin:2.4:install (default-install) @ bungeecord-query ---
[INFO] Installing /home/jenkins/workspace/Bungeecord 1.7.10 Patch/BungeeCord/query/target/bungeecord-query-1.12-SNAPSHOT.jar to /home/jenkins/.m2/repository/net/md-5/bungeecord-query/1.12-SNAPSHOT/bungeecord-query-1.12-SNAPSHOT.jar
[INFO] Installing /home/jenkins/workspace/Bungeecord 1.7.10 Patch/BungeeCord/query/pom.xml to /home/jenkins/.m2/repository/net/md-5/bungeecord-query/1.12-SNAPSHOT/bungeecord-query-1.12-SNAPSHOT.pom
[INFO] 
[INFO] ---------------------< net.md-5:bungeecord-proxy >----------------------
[INFO] Building BungeeCord-Proxy 1.12-SNAPSHOT                          [10/18]
[INFO] --------------------------------[ jar ]---------------------------------
Downloading from central: https://repo.maven.apache.org/maven2/com/flowpowered/flow-nbt/1.0.0/flow-nbt-1.0.0.pom
Progress (1): 2.2/8.5 kB
Progress (1): 5.0/8.5 kB
Progress (1): 7.8/8.5 kB
Progress (1): 8.5 kB    
                    
Downloaded from central: https://repo.maven.apache.org/maven2/com/flowpowered/flow-nbt/1.0.0/flow-nbt-1.0.0.pom (8.5 kB at 55 kB/s)
Downloading from central: https://repo.maven.apache.org/maven2/io/netty/netty-codec-haproxy/4.1.18.Final/netty-codec-haproxy-4.1.18.Final.pom
Progress (1): 1.5 kB
                    
Downloaded from central: https://repo.maven.apache.org/maven2/io/netty/netty-codec-haproxy/4.1.18.Final/netty-codec-haproxy-4.1.18.Final.pom (1.5 kB at 11 kB/s)
Downloading from central: https://repo.maven.apache.org/maven2/io/netty/netty-codec-http/4.1.18.Final/netty-codec-http-4.1.18.Final.pom
Progress (1): 1.9 kB
                    
Downloaded from central: https://repo.maven.apache.org/maven2/io/netty/netty-codec-http/4.1.18.Final/netty-codec-http-4.1.18.Final.pom (1.9 kB at 25 kB/s)
Downloading from central: https://repo.maven.apache.org/maven2/io/netty/netty-handler/4.1.18.Final/netty-handler-4.1.18.Final.pom
Progress (1): 2.2/3.0 kB
Progress (1): 3.0 kB    
                    
Downloaded from central: https://repo.maven.apache.org/maven2/io/netty/netty-handler/4.1.18.Final/netty-handler-4.1.18.Final.pom (3.0 kB at 46 kB/s)
Downloading from central: https://repo.maven.apache.org/maven2/io/netty/netty-transport-native-epoll/4.1.18.Final/netty-transport-native-epoll-4.1.18.Final.pom
Progress (1): 2.8/15 kB
Progress (1): 5.5/15 kB
Progress (1): 8.3/15 kB
Progress (1): 11/15 kB 
Progress (1): 14/15 kB
Progress (1): 15 kB   
                   
Downloaded from central: https://repo.maven.apache.org/maven2/io/netty/netty-transport-native-epoll/4.1.18.Final/netty-transport-native-epoll-4.1.18.Final.pom (15 kB at 163 kB/s)
Downloading from central: https://repo.maven.apache.org/maven2/io/netty/netty-transport-native-unix-common/4.1.18.Final/netty-transport-native-unix-common-4.1.18.Final.pom
Progress (1): 2.2/15 kB
Progress (1): 5.0/15 kB
Progress (1): 7.8/15 kB
Progress (1): 11/15 kB 
Progress (1): 13/15 kB
Progress (1): 15 kB   
                   
Downloaded from central: https://repo.maven.apache.org/maven2/io/netty/netty-transport-native-unix-common/4.1.18.Final/netty-transport-native-unix-common-4.1.18.Final.pom (15 kB at 243 kB/s)
Downloading from central: https://repo.maven.apache.org/maven2/mysql/mysql-connector-java/5.1.44/mysql-connector-java-5.1.44.pom
Progress (1): 1.1 kB
                    
Downloaded from central: https://repo.maven.apache.org/maven2/mysql/mysql-connector-java/5.1.44/mysql-connector-java-5.1.44.pom (1.1 kB at 16 kB/s)
Downloading from central: https://repo.maven.apache.org/maven2/com/flowpowered/flow-nbt/1.0.0/flow-nbt-1.0.0.jar
Downloading from central: https://repo.maven.apache.org/maven2/io/netty/netty-codec-http/4.1.18.Final/netty-codec-http-4.1.18.Final.jar
Downloading from central: https://repo.maven.apache.org/maven2/io/netty/netty-codec-haproxy/4.1.18.Final/netty-codec-haproxy-4.1.18.Final.jar
Downloading from central: https://repo.maven.apache.org/maven2/io/netty/netty-handler/4.1.18.Final/netty-handler-4.1.18.Final.jar
Downloading from central: https://repo.maven.apache.org/maven2/io/netty/netty-transport-native-epoll/4.1.18.Final/netty-transport-native-epoll-4.1.18.Final-linux-x86_64.jar
Progress (1): 2.2/64 kB
Progress (1): 5.0/64 kB
Progress (1): 7.7/64 kB
Progress (1): 10/64 kB 
Progress (1): 13/64 kB
Progress (1): 16/64 kB
Progress (1): 19/64 kB
Progress (1): 21/64 kB
Progress (1): 24/64 kB
Progress (1): 27/64 kB
Progress (1): 30/64 kB
Progress (1): 32/64 kB
Progress (2): 32/64 kB | 2.2/564 kB
Progress (2): 32/64 kB | 5.0/564 kB
Progress (2): 32/64 kB | 7.7/564 kB
Progress (2): 32/64 kB | 10/564 kB 
Progress (2): 32/64 kB | 13/564 kB
Progress (2): 32/64 kB | 16/564 kB
Progress (2): 32/64 kB | 19/564 kB
Progress (2): 32/64 kB | 21/564 kB
Progress (2): 32/64 kB | 24/564 kB
Progress (2): 32/64 kB | 27/564 kB
Progress (2): 32/64 kB | 30/564 kB
Progress (2): 32/64 kB | 32/564 kB
Progress (2): 32/64 kB | 36/564 kB
Progress (2): 32/64 kB | 40/564 kB
Progress (2): 32/64 kB | 45/564 kB
Progress (2): 32/64 kB | 49/564 kB
Progress (2): 32/64 kB | 53/564 kB
Progress (2): 32/64 kB | 57/564 kB
Progress (2): 32/64 kB | 61/564 kB
Progress (2): 32/64 kB | 65/564 kB
Progress (2): 32/64 kB | 69/564 kB
Progress (2): 32/64 kB | 73/564 kB
Progress (2): 32/64 kB | 77/564 kB
Progress (2): 32/64 kB | 81/564 kB
Progress (2): 32/64 kB | 85/564 kB
Progress (2): 32/64 kB | 90/564 kB
Progress (2): 32/64 kB | 94/564 kB
Progress (2): 32/64 kB | 98/564 kB
Progress (2): 36/64 kB | 98/564 kB
Progress (2): 36/64 kB | 102/564 kB
Progress (2): 36/64 kB | 106/564 kB
Progress (2): 40/64 kB | 106/564 kB
Progress (2): 40/64 kB | 110/564 kB
Progress (2): 40/64 kB | 114/564 kB
Progress (2): 45/64 kB | 114/564 kB
Progress (2): 49/64 kB | 114/564 kB
Progress (2): 49/64 kB | 118/564 kB
Progress (2): 49/64 kB | 122/564 kB
Progress (2): 49/64 kB | 126/564 kB
Progress (2): 49/64 kB | 131/564 kB
Progress (2): 49/64 kB | 135/564 kB
Progress (2): 49/64 kB | 139/564 kB
Progress (2): 49/64 kB | 143/564 kB
Progress (2): 49/64 kB | 147/564 kB
Progress (2): 49/64 kB | 151/564 kB
Progress (2): 49/64 kB | 155/564 kB
Progress (2): 49/64 kB | 159/564 kB
Progress (2): 49/64 kB | 163/564 kB
Progress (2): 49/64 kB | 167/564 kB
Progress (2): 49/64 kB | 171/564 kB
Progress (2): 49/64 kB | 176/564 kB
Progress (2): 49/64 kB | 180/564 kB
Progress (2): 53/64 kB | 180/564 kB
Progress (2): 53/64 kB | 184/564 kB
Progress (2): 57/64 kB | 184/564 kB
Progress (2): 57/64 kB | 188/564 kB
Progress (2): 61/64 kB | 188/564 kB
Progress (2): 61/64 kB | 192/564 kB
Progress (2): 64 kB | 192/564 kB   
Progress (2): 64 kB | 196/564 kB
Progress (2): 64 kB | 200/564 kB
Progress (2): 64 kB | 204/564 kB
Progress (2): 64 kB | 208/564 kB
Progress (2): 64 kB | 212/564 kB
Progress (2): 64 kB | 217/564 kB
Progress (2): 64 kB | 221/564 kB
Progress (2): 64 kB | 225/564 kB
Progress (2): 64 kB | 229/564 kB
Progress (2): 64 kB | 233/564 kB
Progress (2): 64 kB | 237/564 kB
Progress (2): 64 kB | 241/564 kB
Progress (2): 64 kB | 245/564 kB
Progress (2): 64 kB | 249/564 kB
Progress (2): 64 kB | 253/564 kB
Progress (2): 64 kB | 258/564 kB
Progress (2): 64 kB | 262/564 kB
Progress (2): 64 kB | 266/564 kB
Progress (2): 64 kB | 270/564 kB
Progress (2): 64 kB | 274/564 kB
Progress (2): 64 kB | 278/564 kB
Progress (3): 64 kB | 278/564 kB | 2.2/141 kB
Progress (3): 64 kB | 278/564 kB | 5.0/141 kB
Progress (3): 64 kB | 278/564 kB | 7.7/141 kB
Progress (3): 64 kB | 282/564 kB | 7.7/141 kB
Progress (3): 64 kB | 286/564 kB | 7.7/141 kB
Progress (3): 64 kB | 290/564 kB | 7.7/141 kB
Progress (3): 64 kB | 294/564 kB | 7.7/141 kB
Progress (3): 64 kB | 294/564 kB | 10/141 kB 
Progress (3): 64 kB | 294/564 kB | 13/141 kB
Progress (3): 64 kB | 294/564 kB | 16/141 kB
Progress (3): 64 kB | 294/564 kB | 19/141 kB
Progress (3): 64 kB | 298/564 kB | 19/141 kB
Progress (3): 64 kB | 303/564 kB | 19/141 kB
Progress (3): 64 kB | 303/564 kB | 21/141 kB
Progress (3): 64 kB | 307/564 kB | 21/141 kB
Progress (3): 64 kB | 311/564 kB | 21/141 kB
Progress (3): 64 kB | 311/564 kB | 24/141 kB
Progress (3): 64 kB | 315/564 kB | 24/141 kB
Progress (3): 64 kB | 319/564 kB | 24/141 kB
Progress (3): 64 kB | 323/564 kB | 24/141 kB
Progress (3): 64 kB | 327/564 kB | 24/141 kB
Progress (3): 64 kB | 327/564 kB | 27/141 kB
Progress (3): 64 kB | 331/564 kB | 27/141 kB
Progress (3): 64 kB | 335/564 kB | 27/141 kB
Progress (3): 64 kB | 339/564 kB | 27/141 kB
Progress (3): 64 kB | 339/564 kB | 30/141 kB
Progress (3): 64 kB | 339/564 kB | 32/141 kB
Progress (3): 64 kB | 344/564 kB | 32/141 kB
Progress (3): 64 kB | 348/564 kB | 32/141 kB
Progress (3): 64 kB | 348/564 kB | 36/141 kB
Progress (3): 64 kB | 352/564 kB | 36/141 kB
Progress (3): 64 kB | 352/564 kB | 40/141 kB
Progress (3): 64 kB | 356/564 kB | 40/141 kB
Progress (3): 64 kB | 356/564 kB | 45/141 kB
Progress (3): 64 kB | 360/564 kB | 45/141 kB
Progress (3): 64 kB | 360/564 kB | 49/141 kB
                                            
Downloaded from central: https://repo.maven.apache.org/maven2/com/flowpowered/flow-nbt/1.0.0/flow-nbt-1.0.0.jar (64 kB at 565 kB/s)
Downloading from central: https://repo.maven.apache.org/maven2/io/netty/netty-transport-native-unix-common/4.1.18.Final/netty-transport-native-unix-common-4.1.18.Final.jar
Progress (2): 364/564 kB | 49/141 kB
Progress (2): 364/564 kB | 53/141 kB
Progress (2): 368/564 kB | 53/141 kB
Progress (2): 368/564 kB | 57/141 kB
Progress (2): 368/564 kB | 61/141 kB
Progress (2): 368/564 kB | 65/141 kB
Progress (2): 368/564 kB | 69/141 kB
Progress (2): 368/564 kB | 73/141 kB
Progress (2): 368/564 kB | 77/141 kB
Progress (2): 368/564 kB | 81/141 kB
Progress (2): 372/564 kB | 81/141 kB
Progress (2): 376/564 kB | 81/141 kB
Progress (2): 380/564 kB | 81/141 kB
Progress (2): 380/564 kB | 85/141 kB
Progress (2): 384/564 kB | 85/141 kB
Progress (2): 384/564 kB | 90/141 kB
Progress (2): 384/564 kB | 94/141 kB
Progress (2): 384/564 kB | 98/141 kB
Progress (2): 384/564 kB | 102/141 kB
Progress (2): 384/564 kB | 106/141 kB
Progress (2): 384/564 kB | 110/141 kB
Progress (2): 384/564 kB | 114/141 kB
Progress (2): 384/564 kB | 118/141 kB
Progress (2): 384/564 kB | 122/141 kB
Progress (2): 384/564 kB | 126/141 kB
Progress (2): 384/564 kB | 131/141 kB
Progress (2): 384/564 kB | 135/141 kB
Progress (2): 384/564 kB | 139/141 kB
Progress (2): 384/564 kB | 141 kB    
Progress (2): 389/564 kB | 141 kB
Progress (2): 393/564 kB | 141 kB
Progress (2): 397/564 kB | 141 kB
Progress (2): 401/564 kB | 141 kB
Progress (2): 405/564 kB | 141 kB
Progress (2): 409/564 kB | 141 kB
Progress (2): 413/564 kB | 141 kB
Progress (2): 417/564 kB | 141 kB
Progress (2): 421/564 kB | 141 kB
Progress (2): 425/564 kB | 141 kB
Progress (2): 430/564 kB | 141 kB
Progress (2): 434/564 kB | 141 kB
Progress (2): 438/564 kB | 141 kB
Progress (2): 442/564 kB | 141 kB
Progress (2): 446/564 kB | 141 kB
Progress (2): 450/564 kB | 141 kB
Progress (2): 454/564 kB | 141 kB
Progress (2): 458/564 kB | 141 kB
Progress (2): 462/564 kB | 141 kB
Progress (2): 466/564 kB | 141 kB
Progress (2): 470/564 kB | 141 kB
Progress (2): 475/564 kB | 141 kB
Progress (2): 479/564 kB | 141 kB
Progress (2): 483/564 kB | 141 kB
Progress (2): 487/564 kB | 141 kB
Progress (2): 491/564 kB | 141 kB
Progress (2): 495/564 kB | 141 kB
Progress (2): 499/564 kB | 141 kB
Progress (2): 503/564 kB | 141 kB
Progress (2): 507/564 kB | 141 kB
Progress (2): 511/564 kB | 141 kB
Progress (2): 516/564 kB | 141 kB
Progress (2): 520/564 kB | 141 kB
Progress (2): 524/564 kB | 141 kB
Progress (2): 528/564 kB | 141 kB
Progress (2): 532/564 kB | 141 kB
Progress (2): 536/564 kB | 141 kB
Progress (2): 540/564 kB | 141 kB
Progress (2): 544/564 kB | 141 kB
Progress (2): 548/564 kB | 141 kB
Progress (2): 552/564 kB | 141 kB
Progress (2): 557/564 kB | 141 kB
Progress (2): 561/564 kB | 141 kB
Progress (2): 564 kB | 141 kB    
                             
Downloaded from central: https://repo.maven.apache.org/maven2/io/netty/netty-transport-native-epoll/4.1.18.Final/netty-transport-native-epoll-4.1.18.Final-linux-x86_64.jar (141 kB at 947 kB/s)
Progress (2): 564 kB | 4.1/31 kB
                                
Downloading from central: https://repo.maven.apache.org/maven2/mysql/mysql-connector-java/5.1.44/mysql-connector-java-5.1.44.jar
Progress (2): 564 kB | 7.7/31 kB
Progress (2): 564 kB | 12/31 kB 
Progress (2): 564 kB | 16/31 kB
Progress (2): 564 kB | 20/31 kB
Progress (2): 564 kB | 24/31 kB
Progress (2): 564 kB | 28/31 kB
Progress (2): 564 kB | 31 kB   
                            
Downloaded from central: https://repo.maven.apache.org/maven2/io/netty/netty-codec-http/4.1.18.Final/netty-codec-http-4.1.18.Final.jar (564 kB at 3.4 MB/s)
Progress (2): 31 kB | 4.1/1000 kB
Progress (2): 31 kB | 7.7/1000 kB
Progress (2): 31 kB | 12/1000 kB 
Progress (2): 31 kB | 16/1000 kB
Progress (2): 31 kB | 20/1000 kB
Progress (2): 31 kB | 24/1000 kB
Progress (2): 31 kB | 28/1000 kB
Progress (2): 31 kB | 32/1000 kB
Progress (2): 31 kB | 36/1000 kB
Progress (2): 31 kB | 40/1000 kB
Progress (2): 31 kB | 45/1000 kB
Progress (2): 31 kB | 49/1000 kB
Progress (2): 31 kB | 53/1000 kB
Progress (2): 31 kB | 57/1000 kB
Progress (2): 31 kB | 61/1000 kB
Progress (2): 31 kB | 65/1000 kB
Progress (2): 31 kB | 69/1000 kB
Progress (2): 31 kB | 73/1000 kB
Progress (2): 31 kB | 77/1000 kB
Progress (2): 31 kB | 81/1000 kB
Progress (2): 31 kB | 85/1000 kB
Progress (2): 31 kB | 90/1000 kB
Progress (2): 31 kB | 94/1000 kB
Progress (2): 31 kB | 98/1000 kB
Progress (2): 31 kB | 102/1000 kB
Progress (2): 31 kB | 106/1000 kB
Progress (2): 31 kB | 110/1000 kB
Progress (2): 31 kB | 114/1000 kB
Progress (2): 31 kB | 118/1000 kB
Progress (2): 31 kB | 122/1000 kB
Progress (2): 31 kB | 126/1000 kB
Progress (2): 31 kB | 131/1000 kB
Progress (2): 31 kB | 135/1000 kB
Progress (2): 31 kB | 139/1000 kB
Progress (2): 31 kB | 143/1000 kB
Progress (2): 31 kB | 147/1000 kB
Progress (2): 31 kB | 151/1000 kB
Progress (2): 31 kB | 155/1000 kB
Progress (2): 31 kB | 159/1000 kB
Progress (2): 31 kB | 163/1000 kB
Progress (2): 31 kB | 167/1000 kB
Progress (2): 31 kB | 171/1000 kB
Progress (2): 31 kB | 176/1000 kB
Progress (2): 31 kB | 180/1000 kB
Progress (2): 31 kB | 184/1000 kB
Progress (2): 31 kB | 188/1000 kB
Progress (2): 31 kB | 192/1000 kB
Progress (2): 31 kB | 196/1000 kB
                                 
Downloaded from central: https://repo.maven.apache.org/maven2/io/netty/netty-transport-native-unix-common/4.1.18.Final/netty-transport-native-unix-common-4.1.18.Final.jar (31 kB at 170 kB/s)
Progress (1): 200/1000 kB
Progress (1): 204/1000 kB
Progress (1): 208/1000 kB
Progress (1): 212/1000 kB
Progress (1): 217/1000 kB
Progress (1): 221/1000 kB
Progress (1): 225/1000 kB
Progress (1): 229/1000 kB
Progress (1): 233/1000 kB
Progress (1): 237/1000 kB
Progress (1): 241/1000 kB
Progress (1): 245/1000 kB
Progress (1): 249/1000 kB
Progress (1): 253/1000 kB
Progress (1): 258/1000 kB
Progress (1): 262/1000 kB
Progress (1): 266/1000 kB
Progress (1): 270/1000 kB
Progress (1): 274/1000 kB
Progress (1): 278/1000 kB
Progress (1): 282/1000 kB
Progress (1): 286/1000 kB
Progress (1): 290/1000 kB
Progress (1): 294/1000 kB
Progress (2): 294/1000 kB | 2.2/25 kB
Progress (2): 298/1000 kB | 2.2/25 kB
Progress (2): 303/1000 kB | 2.2/25 kB
Progress (2): 307/1000 kB | 2.2/25 kB
Progress (2): 311/1000 kB | 2.2/25 kB
Progress (2): 311/1000 kB | 5.0/25 kB
Progress (2): 315/1000 kB | 5.0/25 kB
Progress (2): 319/1000 kB | 5.0/25 kB
Progress (2): 323/1000 kB | 5.0/25 kB
Progress (2): 323/1000 kB | 7.7/25 kB
Progress (2): 327/1000 kB | 7.7/25 kB
Progress (2): 327/1000 kB | 10/25 kB 
Progress (2): 331/1000 kB | 10/25 kB
Progress (2): 335/1000 kB | 10/25 kB
Progress (2): 339/1000 kB | 10/25 kB
Progress (2): 344/1000 kB | 10/25 kB
Progress (2): 344/1000 kB | 13/25 kB
Progress (2): 348/1000 kB | 13/25 kB
Progress (2): 352/1000 kB | 13/25 kB
Progress (2): 356/1000 kB | 13/25 kB
Progress (2): 356/1000 kB | 16/25 kB
Progress (2): 360/1000 kB | 16/25 kB
Progress (2): 360/1000 kB | 19/25 kB
Progress (2): 364/1000 kB | 19/25 kB
Progress (2): 368/1000 kB | 19/25 kB
Progress (2): 372/1000 kB | 19/25 kB
Progress (2): 376/1000 kB | 19/25 kB
Progress (2): 376/1000 kB | 21/25 kB
Progress (2): 380/1000 kB | 21/25 kB
Progress (2): 384/1000 kB | 21/25 kB
Progress (2): 384/1000 kB | 24/25 kB
Progress (2): 389/1000 kB | 24/25 kB
Progress (2): 393/1000 kB | 24/25 kB
Progress (2): 393/1000 kB | 25 kB   
Progress (3): 393/1000 kB | 25 kB | 2.2/375 kB
Progress (3): 393/1000 kB | 25 kB | 5.0/375 kB
Progress (3): 397/1000 kB | 25 kB | 5.0/375 kB
Progress (3): 401/1000 kB | 25 kB | 5.0/375 kB
Progress (3): 401/1000 kB | 25 kB | 7.7/375 kB
Progress (3): 401/1000 kB | 25 kB | 10/375 kB 
Progress (3): 401/1000 kB | 25 kB | 13/375 kB
Progress (3): 405/1000 kB | 25 kB | 13/375 kB
Progress (3): 409/1000 kB | 25 kB | 13/375 kB
Progress (3): 409/1000 kB | 25 kB | 16/375 kB
Progress (3): 413/1000 kB | 25 kB | 16/375 kB
Progress (3): 417/1000 kB | 25 kB | 16/375 kB
Progress (3): 421/1000 kB | 25 kB | 16/375 kB
Progress (3): 425/1000 kB | 25 kB | 16/375 kB
Progress (3): 425/1000 kB | 25 kB | 19/375 kB
Progress (3): 430/1000 kB | 25 kB | 19/375 kB
Progress (3): 430/1000 kB | 25 kB | 21/375 kB
Progress (3): 434/1000 kB | 25 kB | 21/375 kB
Progress (3): 438/1000 kB | 25 kB | 21/375 kB
Progress (3): 438/1000 kB | 25 kB | 24/375 kB
Progress (3): 442/1000 kB | 25 kB | 24/375 kB
Progress (3): 446/1000 kB | 25 kB | 24/375 kB
Progress (3): 450/1000 kB | 25 kB | 24/375 kB
Progress (3): 454/1000 kB | 25 kB | 24/375 kB
Progress (3): 458/1000 kB | 25 kB | 24/375 kB
Progress (3): 462/1000 kB | 25 kB | 24/375 kB
Progress (3): 462/1000 kB | 25 kB | 27/375 kB
Progress (3): 466/1000 kB | 25 kB | 27/375 kB
Progress (3): 470/1000 kB | 25 kB | 27/375 kB
Progress (3): 475/1000 kB | 25 kB | 27/375 kB
Progress (3): 475/1000 kB | 25 kB | 30/375 kB
Progress (3): 475/1000 kB | 25 kB | 32/375 kB
Progress (3): 479/1000 kB | 25 kB | 32/375 kB
Progress (3): 483/1000 kB | 25 kB | 32/375 kB
Progress (3): 487/1000 kB | 25 kB | 32/375 kB
Progress (3): 491/1000 kB | 25 kB | 32/375 kB
Progress (3): 495/1000 kB | 25 kB | 32/375 kB
Progress (3): 499/1000 kB | 25 kB | 32/375 kB
Progress (3): 503/1000 kB | 25 kB | 32/375 kB
Progress (3): 507/1000 kB | 25 kB | 32/375 kB
Progress (3): 511/1000 kB | 25 kB | 32/375 kB
Progress (3): 516/1000 kB | 25 kB | 32/375 kB
Progress (3): 516/1000 kB | 25 kB | 36/375 kB
Progress (3): 520/1000 kB | 25 kB | 36/375 kB
Progress (3): 520/1000 kB | 25 kB | 40/375 kB
Progress (3): 524/1000 kB | 25 kB | 40/375 kB
Progress (3): 524/1000 kB | 25 kB | 45/375 kB
Progress (3): 524/1000 kB | 25 kB | 49/375 kB
Progress (3): 528/1000 kB | 25 kB | 49/375 kB
Progress (3): 532/1000 kB | 25 kB | 49/375 kB
Progress (3): 536/1000 kB | 25 kB | 49/375 kB
Progress (3): 540/1000 kB | 25 kB | 49/375 kB
Progress (3): 540/1000 kB | 25 kB | 53/375 kB
Progress (3): 544/1000 kB | 25 kB | 53/375 kB
Progress (3): 548/1000 kB | 25 kB | 53/375 kB
Progress (3): 552/1000 kB | 25 kB | 53/375 kB
Progress (3): 557/1000 kB | 25 kB | 53/375 kB
Progress (3): 557/1000 kB | 25 kB | 57/375 kB
Progress (3): 557/1000 kB | 25 kB | 61/375 kB
Progress (3): 561/1000 kB | 25 kB | 61/375 kB
Progress (3): 561/1000 kB | 25 kB | 65/375 kB
Progress (3): 565/1000 kB | 25 kB | 65/375 kB
Progress (3): 569/1000 kB | 25 kB | 65/375 kB
Progress (3): 573/1000 kB | 25 kB | 65/375 kB
Progress (3): 577/1000 kB | 25 kB | 65/375 kB
Progress (3): 581/1000 kB | 25 kB | 65/375 kB
Progress (3): 581/1000 kB | 25 kB | 69/375 kB
Progress (3): 585/1000 kB | 25 kB | 69/375 kB
Progress (3): 585/1000 kB | 25 kB | 73/375 kB
Progress (3): 589/1000 kB | 25 kB | 73/375 kB
Progress (3): 589/1000 kB | 25 kB | 77/375 kB
Progress (3): 589/1000 kB | 25 kB | 81/375 kB
Progress (3): 589/1000 kB | 25 kB | 85/375 kB
Progress (3): 593/1000 kB | 25 kB | 85/375 kB
Progress (3): 597/1000 kB | 25 kB | 85/375 kB
Progress (3): 602/1000 kB | 25 kB | 85/375 kB
Progress (3): 606/1000 kB | 25 kB | 85/375 kB
Progress (3): 606/1000 kB | 25 kB | 90/375 kB
Progress (3): 610/1000 kB | 25 kB | 90/375 kB
Progress (3): 614/1000 kB | 25 kB | 90/375 kB
Progress (3): 618/1000 kB | 25 kB | 90/375 kB
Progress (3): 618/1000 kB | 25 kB | 94/375 kB
Progress (3): 622/1000 kB | 25 kB | 94/375 kB
Progress (3): 622/1000 kB | 25 kB | 98/375 kB
Progress (3): 626/1000 kB | 25 kB | 98/375 kB
Progress (3): 630/1000 kB | 25 kB | 98/375 kB
Progress (3): 634/1000 kB | 25 kB | 98/375 kB
Progress (3): 634/1000 kB | 25 kB | 102/375 kB
Progress (3): 638/1000 kB | 25 kB | 102/375 kB
Progress (3): 638/1000 kB | 25 kB | 106/375 kB
Progress (3): 638/1000 kB | 25 kB | 110/375 kB
Progress (3): 638/1000 kB | 25 kB | 114/375 kB
Progress (3): 643/1000 kB | 25 kB | 114/375 kB
Progress (3): 647/1000 kB | 25 kB | 114/375 kB
Progress (3): 651/1000 kB | 25 kB | 114/375 kB
Progress (3): 655/1000 kB | 25 kB | 114/375 kB
Progress (3): 655/1000 kB | 25 kB | 118/375 kB
Progress (3): 655/1000 kB | 25 kB | 122/375 kB
Progress (3): 655/1000 kB | 25 kB | 126/375 kB
Progress (3): 655/1000 kB | 25 kB | 131/375 kB
Progress (3): 659/1000 kB | 25 kB | 131/375 kB
Progress (3): 663/1000 kB | 25 kB | 131/375 kB
Progress (3): 667/1000 kB | 25 kB | 131/375 kB
Progress (3): 671/1000 kB | 25 kB | 131/375 kB
Progress (3): 671/1000 kB | 25 kB | 135/375 kB
Progress (3): 671/1000 kB | 25 kB | 139/375 kB
Progress (3): 675/1000 kB | 25 kB | 139/375 kB
Progress (3): 675/1000 kB | 25 kB | 143/375 kB
Progress (3): 679/1000 kB | 25 kB | 143/375 kB
Progress (3): 679/1000 kB | 25 kB | 147/375 kB
Progress (3): 683/1000 kB | 25 kB | 147/375 kB
Progress (3): 688/1000 kB | 25 kB | 147/375 kB
Progress (3): 688/1000 kB | 25 kB | 151/375 kB
Progress (3): 692/1000 kB | 25 kB | 151/375 kB
Progress (3): 692/1000 kB | 25 kB | 155/375 kB
Progress (3): 696/1000 kB | 25 kB | 155/375 kB
Progress (3): 696/1000 kB | 25 kB | 159/375 kB
Progress (3): 700/1000 kB | 25 kB | 159/375 kB
Progress (3): 704/1000 kB | 25 kB | 159/375 kB
Progress (3): 704/1000 kB | 25 kB | 163/375 kB
Progress (3): 708/1000 kB | 25 kB | 163/375 kB
Progress (3): 712/1000 kB | 25 kB | 163/375 kB
Progress (3): 716/1000 kB | 25 kB | 163/375 kB
Progress (3): 720/1000 kB | 25 kB | 163/375 kB
Progress (3): 720/1000 kB | 25 kB | 167/375 kB
Progress (3): 720/1000 kB | 25 kB | 171/375 kB
Progress (3): 724/1000 kB | 25 kB | 171/375 kB
Progress (3): 724/1000 kB | 25 kB | 176/375 kB
Progress (3): 729/1000 kB | 25 kB | 176/375 kB
Progress (3): 729/1000 kB | 25 kB | 180/375 kB
Progress (3): 733/1000 kB | 25 kB | 180/375 kB
Progress (3): 737/1000 kB | 25 kB | 180/375 kB
Progress (3): 741/1000 kB | 25 kB | 180/375 kB
Progress (3): 745/1000 kB | 25 kB | 180/375 kB
Progress (3): 749/1000 kB | 25 kB | 180/375 kB
Progress (3): 753/1000 kB | 25 kB | 180/375 kB
Progress (3): 753/1000 kB | 25 kB | 184/375 kB
Progress (3): 753/1000 kB | 25 kB | 188/375 kB
Progress (3): 753/1000 kB | 25 kB | 192/375 kB
Progress (3): 753/1000 kB | 25 kB | 196/375 kB
Progress (3): 757/1000 kB | 25 kB | 196/375 kB
Progress (3): 761/1000 kB | 25 kB | 196/375 kB
Progress (3): 765/1000 kB | 25 kB | 196/375 kB
Progress (3): 770/1000 kB | 25 kB | 196/375 kB
Progress (3): 774/1000 kB | 25 kB | 196/375 kB
Progress (3): 778/1000 kB | 25 kB | 196/375 kB
Progress (3): 782/1000 kB | 25 kB | 196/375 kB
Progress (3): 786/1000 kB | 25 kB | 196/375 kB
Progress (3): 790/1000 kB | 25 kB | 196/375 kB
Progress (3): 794/1000 kB | 25 kB | 196/375 kB
Progress (3): 794/1000 kB | 25 kB | 200/375 kB
Progress (3): 798/1000 kB | 25 kB | 200/375 kB
Progress (3): 798/1000 kB | 25 kB | 204/375 kB
Progress (3): 802/1000 kB | 25 kB | 204/375 kB
Progress (3): 802/1000 kB | 25 kB | 208/375 kB
Progress (3): 802/1000 kB | 25 kB | 212/375 kB
Progress (3): 806/1000 kB | 25 kB | 212/375 kB
Progress (3): 810/1000 kB | 25 kB | 212/375 kB
Progress (3): 815/1000 kB | 25 kB | 212/375 kB
Progress (3): 819/1000 kB | 25 kB | 212/375 kB
Progress (3): 823/1000 kB | 25 kB | 212/375 kB
Progress (3): 827/1000 kB | 25 kB | 212/375 kB
Progress (3): 831/1000 kB | 25 kB | 212/375 kB
Progress (3): 835/1000 kB | 25 kB | 212/375 kB
Progress (3): 839/1000 kB | 25 kB | 212/375 kB
Progress (3): 843/1000 kB | 25 kB | 212/375 kB
Progress (3): 847/1000 kB | 25 kB | 212/375 kB
                                              
Downloaded from central: https://repo.maven.apache.org/maven2/io/netty/netty-codec-haproxy/4.1.18.Final/netty-codec-haproxy-4.1.18.Final.jar (25 kB at 105 kB/s)
Progress (2): 847/1000 kB | 217/375 kB
Progress (2): 847/1000 kB | 221/375 kB
Progress (2): 847/1000 kB | 225/375 kB
Progress (2): 847/1000 kB | 229/375 kB
Progress (2): 847/1000 kB | 233/375 kB
Progress (2): 847/1000 kB | 237/375 kB
Progress (2): 851/1000 kB | 237/375 kB
Progress (2): 851/1000 kB | 241/375 kB
Progress (2): 851/1000 kB | 245/375 kB
Progress (2): 856/1000 kB | 245/375 kB
Progress (2): 860/1000 kB | 245/375 kB
Progress (2): 864/1000 kB | 245/375 kB
Progress (2): 868/1000 kB | 245/375 kB
Progress (2): 872/1000 kB | 245/375 kB
Progress (2): 876/1000 kB | 245/375 kB
Progress (2): 880/1000 kB | 245/375 kB
Progress (2): 884/1000 kB | 245/375 kB
Progress (2): 888/1000 kB | 245/375 kB
Progress (2): 892/1000 kB | 245/375 kB
Progress (2): 892/1000 kB | 249/375 kB
Progress (2): 896/1000 kB | 249/375 kB
Progress (2): 896/1000 kB | 253/375 kB
Progress (2): 901/1000 kB | 253/375 kB
Progress (2): 901/1000 kB | 258/375 kB
Progress (2): 901/1000 kB | 262/375 kB
Progress (2): 905/1000 kB | 262/375 kB
Progress (2): 909/1000 kB | 262/375 kB
Progress (2): 913/1000 kB | 262/375 kB
Progress (2): 917/1000 kB | 262/375 kB
Progress (2): 921/1000 kB | 262/375 kB
Progress (2): 925/1000 kB | 262/375 kB
Progress (2): 929/1000 kB | 262/375 kB
Progress (2): 933/1000 kB | 262/375 kB
Progress (2): 937/1000 kB | 262/375 kB
Progress (2): 942/1000 kB | 262/375 kB
Progress (2): 946/1000 kB | 262/375 kB
Progress (2): 950/1000 kB | 262/375 kB
Progress (2): 950/1000 kB | 266/375 kB
Progress (2): 950/1000 kB | 270/375 kB
Progress (2): 950/1000 kB | 274/375 kB
Progress (2): 954/1000 kB | 274/375 kB
Progress (2): 954/1000 kB | 278/375 kB
Progress (2): 958/1000 kB | 278/375 kB
Progress (2): 962/1000 kB | 278/375 kB
Progress (2): 966/1000 kB | 278/375 kB
Progress (2): 970/1000 kB | 278/375 kB
Progress (2): 974/1000 kB | 278/375 kB
Progress (2): 978/1000 kB | 278/375 kB
Progress (2): 982/1000 kB | 278/375 kB
Progress (2): 982/1000 kB | 282/375 kB
Progress (2): 982/1000 kB | 286/375 kB
Progress (2): 987/1000 kB | 286/375 kB
Progress (2): 987/1000 kB | 290/375 kB
Progress (2): 991/1000 kB | 290/375 kB
Progress (2): 991/1000 kB | 294/375 kB
Progress (2): 995/1000 kB | 294/375 kB
Progress (2): 999/1000 kB | 294/375 kB
Progress (2): 1000 kB | 294/375 kB    
Progress (2): 1000 kB | 298/375 kB
Progress (2): 1000 kB | 303/375 kB
Progress (2): 1000 kB | 307/375 kB
Progress (2): 1000 kB | 311/375 kB
Progress (2): 1000 kB | 315/375 kB
Progress (2): 1000 kB | 319/375 kB
Progress (2): 1000 kB | 323/375 kB
Progress (2): 1000 kB | 327/375 kB
Progress (2): 1000 kB | 331/375 kB
Progress (2): 1000 kB | 335/375 kB
Progress (2): 1000 kB | 339/375 kB
Progress (2): 1000 kB | 344/375 kB
Progress (2): 1000 kB | 348/375 kB
Progress (2): 1000 kB | 352/375 kB
Progress (2): 1000 kB | 356/375 kB
Progress (2): 1000 kB | 360/375 kB
Progress (2): 1000 kB | 364/375 kB
Progress (2): 1000 kB | 368/375 kB
Progress (2): 1000 kB | 372/375 kB
Progress (2): 1000 kB | 375 kB    
                              
Downloaded from central: https://repo.maven.apache.org/maven2/mysql/mysql-connector-java/5.1.44/mysql-connector-java-5.1.44.jar (1000 kB at 3.6 MB/s)
Downloaded from central: https://repo.maven.apache.org/maven2/io/netty/netty-handler/4.1.18.Final/netty-handler-4.1.18.Final.jar (375 kB at 1.3 MB/s)
[INFO] 
[INFO] --- maven-clean-plugin:2.5:clean (default-clean) @ bungeecord-proxy ---
[INFO] 
[INFO] --- scriptus:0.3.1:describe (default) @ bungeecord-proxy ---
[INFO] Set property "describe" to "git:BungeeCord-Proxy:1.12-SNAPSHOT:aadfe0b:unknown"
[INFO] 
[INFO] --- maven-resources-plugin:2.6:resources (default-resources) @ bungeecord-proxy ---
[INFO] Using 'UTF-8' encoding to copy filtered resources.
[INFO] Copying 1 resource
[INFO] 
[INFO] --- maven-compiler-plugin:3.1:compile (default-compile) @ bungeecord-proxy ---
[INFO] Changes detected - recompiling the module!
[INFO] Compiling 70 source files to /home/jenkins/workspace/Bungeecord 1.7.10 Patch/BungeeCord/proxy/target/classes
[WARNING] /home/jenkins/workspace/Bungeecord 1.7.10 Patch/BungeeCord/proxy/src/main/java/net/md_5/bungee/conf/Configuration.java: Some input files use or override a deprecated API.
[WARNING] /home/jenkins/workspace/Bungeecord 1.7.10 Patch/BungeeCord/proxy/src/main/java/net/md_5/bungee/conf/Configuration.java: Recompile with -Xlint:deprecation for details.
[WARNING] /home/jenkins/workspace/Bungeecord 1.7.10 Patch/BungeeCord/proxy/src/main/java/net/md_5/bungee/netty/ChannelWrapper.java: Some input files use unchecked or unsafe operations.
[WARNING] /home/jenkins/workspace/Bungeecord 1.7.10 Patch/BungeeCord/proxy/src/main/java/net/md_5/bungee/netty/ChannelWrapper.java: Recompile with -Xlint:unchecked for details.
[INFO] 
[INFO] --- animal-sniffer-maven-plugin:1.16:check (default) @ bungeecord-proxy ---
[INFO] Checking unresolved references to org.codehaus.mojo.signature:java17:1.0
[INFO] 
[INFO] --- maven-resources-plugin:2.6:testResources (default-testResources) @ bungeecord-proxy ---
[INFO] Using 'UTF-8' encoding to copy filtered resources.
[INFO] skip non existing resourceDirectory /home/jenkins/workspace/Bungeecord 1.7.10 Patch/BungeeCord/proxy/src/test/resources
[INFO] 
[INFO] --- maven-compiler-plugin:3.1:testCompile (default-testCompile) @ bungeecord-proxy ---
[INFO] Changes detected - recompiling the module!
[INFO] Compiling 5 source files to /home/jenkins/workspace/Bungeecord 1.7.10 Patch/BungeeCord/proxy/target/test-classes
[INFO] 
[INFO] --- maven-surefire-plugin:2.12.4:test (default-test) @ bungeecord-proxy ---
[INFO] Surefire report directory: /home/jenkins/workspace/Bungeecord 1.7.10 Patch/BungeeCord/proxy/target/surefire-reports

-------------------------------------------------------
 T E S T S
-------------------------------------------------------
Running net.md_5.bungee.chat.ComponentsTest
Tests run: 12, Failures: 0, Errors: 0, Skipped: 0, Time elapsed: 0.151 sec
Running net.md_5.bungee.scheduler.SchedulerTest
Tests run: 3, Failures: 0, Errors: 0, Skipped: 0, Time elapsed: 1.34 sec
Running net.md_5.bungee.ThrottleTest
Tests run: 1, Failures: 0, Errors: 0, Skipped: 0, Time elapsed: 0.129 sec
Running net.md_5.bungee.util.BoundedArrayListTest
Tests run: 9, Failures: 0, Errors: 0, Skipped: 0, Time elapsed: 0.008 sec

Results :

Tests run: 25, Failures: 0, Errors: 0, Skipped: 0

[INFO] 
[INFO] --- maven-jar-plugin:2.4:jar (default-jar) @ bungeecord-proxy ---
[INFO] Building jar: /home/jenkins/workspace/Bungeecord 1.7.10 Patch/BungeeCord/proxy/target/bungeecord-proxy-1.12-SNAPSHOT.jar
[INFO] 
[INFO] --- maven-install-plugin:2.4:install (default-install) @ bungeecord-proxy ---
[INFO] Installing /home/jenkins/workspace/Bungeecord 1.7.10 Patch/BungeeCord/proxy/target/bungeecord-proxy-1.12-SNAPSHOT.jar to /home/jenkins/.m2/repository/net/md-5/bungeecord-proxy/1.12-SNAPSHOT/bungeecord-proxy-1.12-SNAPSHOT.jar
[INFO] Installing /home/jenkins/workspace/Bungeecord 1.7.10 Patch/BungeeCord/proxy/pom.xml to /home/jenkins/.m2/repository/net/md-5/bungeecord-proxy/1.12-SNAPSHOT/bungeecord-proxy-1.12-SNAPSHOT.pom
[INFO] 
[INFO] -------------------< net.md-5:bungeecord-bootstrap >--------------------
[INFO] Building BungeeCord-Bootstrap 1.12-SNAPSHOT                      [11/18]
[INFO] --------------------------------[ jar ]---------------------------------
Downloading from central: https://repo.maven.apache.org/maven2/org/apache/maven/plugins/maven-jar-plugin/3.0.2/maven-jar-plugin-3.0.2.pom
Downloaded from central: https://repo.maven.apache.org/maven2/org/apache/maven/plugins/maven-jar-plugin/3.0.2/maven-jar-plugin-3.0.2.pom (0 B at 0 B/s)
Downloading from central: https://repo.maven.apache.org/maven2/org/apache/maven/plugins/maven-plugins/30/maven-plugins-30.pom
Downloaded from central: https://repo.maven.apache.org/maven2/org/apache/maven/plugins/maven-plugins/30/maven-plugins-30.pom (0 B at 0 B/s)
Downloading from central: https://repo.maven.apache.org/maven2/org/apache/maven/plugins/maven-jar-plugin/3.0.2/maven-jar-plugin-3.0.2.jar
Downloaded from central: https://repo.maven.apache.org/maven2/org/apache/maven/plugins/maven-jar-plugin/3.0.2/maven-jar-plugin-3.0.2.jar (0 B at 0 B/s)
Downloading from central: https://repo.maven.apache.org/maven2/org/apache/maven/plugins/maven-shade-plugin/3.0.0/maven-shade-plugin-3.0.0.pom
Downloaded from central: https://repo.maven.apache.org/maven2/org/apache/maven/plugins/maven-shade-plugin/3.0.0/maven-shade-plugin-3.0.0.pom (0 B at 0 B/s)
Downloading from central: https://repo.maven.apache.org/maven2/org/apache/maven/plugins/maven-shade-plugin/3.0.0/maven-shade-plugin-3.0.0.jar
Downloaded from central: https://repo.maven.apache.org/maven2/org/apache/maven/plugins/maven-shade-plugin/3.0.0/maven-shade-plugin-3.0.0.jar (0 B at 0 B/s)
[INFO] 
[INFO] --- maven-clean-plugin:2.5:clean (default-clean) @ bungeecord-bootstrap ---
[INFO] 
[INFO] --- scriptus:0.3.1:describe (default) @ bungeecord-bootstrap ---
[INFO] Set property "describe" to "git:BungeeCord-Bootstrap:1.12-SNAPSHOT:aadfe0b:unknown"
[INFO] 
[INFO] --- maven-resources-plugin:2.6:resources (default-resources) @ bungeecord-bootstrap ---
[INFO] Using 'UTF-8' encoding to copy filtered resources.
[INFO] skip non existing resourceDirectory /home/jenkins/workspace/Bungeecord 1.7.10 Patch/BungeeCord/bootstrap/src/main/resources
[INFO] 
[INFO] --- maven-compiler-plugin:3.1:compile (default-compile) @ bungeecord-bootstrap ---
[INFO] Changes detected - recompiling the module!
[INFO] Compiling 2 source files to /home/jenkins/workspace/Bungeecord 1.7.10 Patch/BungeeCord/bootstrap/target/classes
[INFO] 
[INFO] --- animal-sniffer-maven-plugin:1.16:check (default) @ bungeecord-bootstrap ---
[INFO] Checking unresolved references to org.codehaus.mojo.signature:java17:1.0
[INFO] 
[INFO] --- maven-resources-plugin:2.6:testResources (default-testResources) @ bungeecord-bootstrap ---
[INFO] Using 'UTF-8' encoding to copy filtered resources.
[INFO] skip non existing resourceDirectory /home/jenkins/workspace/Bungeecord 1.7.10 Patch/BungeeCord/bootstrap/src/test/resources
[INFO] 
[INFO] --- maven-compiler-plugin:3.1:testCompile (default-testCompile) @ bungeecord-bootstrap ---
[INFO] No sources to compile
[INFO] 
[INFO] --- maven-surefire-plugin:2.12.4:test (default-test) @ bungeecord-bootstrap ---
[INFO] No tests to run.
[INFO] 
[INFO] --- maven-jar-plugin:3.0.2:jar (default-jar) @ bungeecord-bootstrap ---
Downloading from central: https://repo.maven.apache.org/maven2/org/codehaus/plexus/plexus-component-annotations/1.6/plexus-component-annotations-1.6.pom
Downloaded from central: https://repo.maven.apache.org/maven2/org/codehaus/plexus/plexus-component-annotations/1.6/plexus-component-annotations-1.6.pom (0 B at 0 B/s)
Downloading from central: https://repo.maven.apache.org/maven2/org/codehaus/plexus/plexus-containers/1.6/plexus-containers-1.6.pom
Downloaded from central: https://repo.maven.apache.org/maven2/org/codehaus/plexus/plexus-containers/1.6/plexus-containers-1.6.pom (0 B at 0 B/s)
Downloading from central: https://repo.maven.apache.org/maven2/org/codehaus/plexus/plexus/3.3.2/plexus-3.3.2.pom
Downloaded from central: https://repo.maven.apache.org/maven2/org/codehaus/plexus/plexus/3.3.2/plexus-3.3.2.pom (0 B at 0 B/s)
Downloading from central: https://repo.maven.apache.org/maven2/org/apache/maven/maven-archiver/3.1.1/maven-archiver-3.1.1.pom
Downloaded from central: https://repo.maven.apache.org/maven2/org/apache/maven/maven-archiver/3.1.1/maven-archiver-3.1.1.pom (0 B at 0 B/s)
Downloading from central: https://repo.maven.apache.org/maven2/org/apache/maven/shared/maven-shared-utils/3.0.1/maven-shared-utils-3.0.1.pom
Downloaded from central: https://repo.maven.apache.org/maven2/org/apache/maven/shared/maven-shared-utils/3.0.1/maven-shared-utils-3.0.1.pom (0 B at 0 B/s)
Downloading from central: https://repo.maven.apache.org/maven2/commons-io/commons-io/2.4/commons-io-2.4.pom
Downloaded from central: https://repo.maven.apache.org/maven2/commons-io/commons-io/2.4/commons-io-2.4.pom (0 B at 0 B/s)
Downloading from central: https://repo.maven.apache.org/maven2/org/apache/commons/commons-parent/25/commons-parent-25.pom
Downloaded from central: https://repo.maven.apache.org/maven2/org/apache/commons/commons-parent/25/commons-parent-25.pom (0 B at 0 B/s)
Downloading from central: https://repo.maven.apache.org/maven2/org/codehaus/plexus/plexus-archiver/3.3/plexus-archiver-3.3.pom
Downloaded from central: https://repo.maven.apache.org/maven2/org/codehaus/plexus/plexus-archiver/3.3/plexus-archiver-3.3.pom (0 B at 0 B/s)
Downloading from central: https://repo.maven.apache.org/maven2/org/codehaus/plexus/plexus-io/2.7.1/plexus-io-2.7.1.pom
Downloaded from central: https://repo.maven.apache.org/maven2/org/codehaus/plexus/plexus-io/2.7.1/plexus-io-2.7.1.pom (0 B at 0 B/s)
Downloading from central: https://repo.maven.apache.org/maven2/org/codehaus/plexus/plexus-utils/3.0.22/plexus-utils-3.0.22.pom
Downloaded from central: https://repo.maven.apache.org/maven2/org/codehaus/plexus/plexus-utils/3.0.22/plexus-utils-3.0.22.pom (0 B at 0 B/s)
Downloading from central: https://repo.maven.apache.org/maven2/commons-io/commons-io/2.2/commons-io-2.2.pom
Downloaded from central: https://repo.maven.apache.org/maven2/commons-io/commons-io/2.2/commons-io-2.2.pom (0 B at 0 B/s)
Downloading from central: https://repo.maven.apache.org/maven2/org/apache/commons/commons-parent/24/commons-parent-24.pom
Downloaded from central: https://repo.maven.apache.org/maven2/org/apache/commons/commons-parent/24/commons-parent-24.pom (0 B at 0 B/s)
Downloading from central: https://repo.maven.apache.org/maven2/org/apache/commons/commons-compress/1.11/commons-compress-1.11.pom
Downloaded from central: https://repo.maven.apache.org/maven2/org/apache/commons/commons-compress/1.11/commons-compress-1.11.pom (0 B at 0 B/s)
Downloading from central: https://repo.maven.apache.org/maven2/org/iq80/snappy/snappy/0.4/snappy-0.4.pom
Downloaded from central: https://repo.maven.apache.org/maven2/org/iq80/snappy/snappy/0.4/snappy-0.4.pom (0 B at 0 B/s)
Downloading from central: https://repo.maven.apache.org/maven2/org/tukaani/xz/1.5/xz-1.5.pom
Downloaded from central: https://repo.maven.apache.org/maven2/org/tukaani/xz/1.5/xz-1.5.pom (0 B at 0 B/s)
Downloading from central: https://repo.maven.apache.org/maven2/org/codehaus/plexus/plexus-interpolation/1.22/plexus-interpolation-1.22.pom
Downloaded from central: https://repo.maven.apache.org/maven2/org/codehaus/plexus/plexus-interpolation/1.22/plexus-interpolation-1.22.pom (0 B at 0 B/s)
Downloading from central: https://repo.maven.apache.org/maven2/org/codehaus/plexus/plexus-archiver/3.4/plexus-archiver-3.4.pom
Downloaded from central: https://repo.maven.apache.org/maven2/org/codehaus/plexus/plexus-archiver/3.4/plexus-archiver-3.4.pom (0 B at 0 B/s)
Downloading from central: https://repo.maven.apache.org/maven2/org/apache/maven/maven-archiver/3.1.1/maven-archiver-3.1.1.jar
Downloading from central: https://repo.maven.apache.org/maven2/org/codehaus/plexus/plexus-component-annotations/1.6/plexus-component-annotations-1.6.jar
Downloading from central: https://repo.maven.apache.org/maven2/org/codehaus/plexus/plexus-archiver/3.4/plexus-archiver-3.4.jar
Downloading from central: https://repo.maven.apache.org/maven2/org/apache/maven/shared/maven-shared-utils/3.0.1/maven-shared-utils-3.0.1.jar
Downloading from central: https://repo.maven.apache.org/maven2/org/codehaus/plexus/plexus-io/2.7.1/plexus-io-2.7.1.jar
Downloaded from central: https://repo.maven.apache.org/maven2/org/codehaus/plexus/plexus-archiver/3.4/plexus-archiver-3.4.jar (0 B at 0 B/s)
Downloading from central: https://repo.maven.apache.org/maven2/org/apache/commons/commons-compress/1.11/commons-compress-1.11.jar
Downloaded from central: https://repo.maven.apache.org/maven2/org/codehaus/plexus/plexus-component-annotations/1.6/plexus-component-annotations-1.6.jar (0 B at 0 B/s)
Downloaded from central: https://repo.maven.apache.org/maven2/org/apache/maven/maven-archiver/3.1.1/maven-archiver-3.1.1.jar (0 B at 0 B/s)
Downloaded from central: https://repo.maven.apache.org/maven2/org/codehaus/plexus/plexus-io/2.7.1/plexus-io-2.7.1.jar (0 B at 0 B/s)
Downloading from central: https://repo.maven.apache.org/maven2/org/iq80/snappy/snappy/0.4/snappy-0.4.jar
Downloading from central: https://repo.maven.apache.org/maven2/org/codehaus/plexus/plexus-utils/3.0.24/plexus-utils-3.0.24.jar
Downloading from central: https://repo.maven.apache.org/maven2/org/tukaani/xz/1.5/xz-1.5.jar
Downloaded from central: https://repo.maven.apache.org/maven2/org/apache/maven/shared/maven-shared-utils/3.0.1/maven-shared-utils-3.0.1.jar (0 B at 0 B/s)
Downloaded from central: https://repo.maven.apache.org/maven2/org/apache/commons/commons-compress/1.11/commons-compress-1.11.jar (0 B at 0 B/s)
Downloaded from central: https://repo.maven.apache.org/maven2/org/iq80/snappy/snappy/0.4/snappy-0.4.jar (0 B at 0 B/s)
Downloaded from central: https://repo.maven.apache.org/maven2/org/codehaus/plexus/plexus-utils/3.0.24/plexus-utils-3.0.24.jar (0 B at 0 B/s)
Downloaded from central: https://repo.maven.apache.org/maven2/org/tukaani/xz/1.5/xz-1.5.jar (0 B at 0 B/s)
[INFO] Building jar: /home/jenkins/workspace/Bungeecord 1.7.10 Patch/BungeeCord/bootstrap/target/BungeeCord.jar
[INFO] 
[INFO] --- maven-shade-plugin:3.0.0:shade (default) @ bungeecord-bootstrap ---
Downloading from central: https://repo.maven.apache.org/maven2/org/apache/maven/shared/maven-artifact-transfer/0.9.0/maven-artifact-transfer-0.9.0.pom
Downloaded from central: https://repo.maven.apache.org/maven2/org/apache/maven/shared/maven-artifact-transfer/0.9.0/maven-artifact-transfer-0.9.0.pom (0 B at 0 B/s)
Downloading from central: https://repo.maven.apache.org/maven2/org/apache/maven/shared/maven-common-artifact-filters/3.0.0/maven-common-artifact-filters-3.0.0.pom
Downloaded from central: https://repo.maven.apache.org/maven2/org/apache/maven/shared/maven-common-artifact-filters/3.0.0/maven-common-artifact-filters-3.0.0.pom (0 B at 0 B/s)
Downloading from central: https://repo.maven.apache.org/maven2/org/apache/maven/shared/maven-shared-components/22/maven-shared-components-22.pom
Downloaded from central: https://repo.maven.apache.org/maven2/org/apache/maven/shared/maven-shared-components/22/maven-shared-components-22.pom (0 B at 0 B/s)
Downloading from central: https://repo.maven.apache.org/maven2/org/apache/maven/maven-parent/27/maven-parent-27.pom
Downloaded from central: https://repo.maven.apache.org/maven2/org/apache/maven/maven-parent/27/maven-parent-27.pom (0 B at 0 B/s)
Downloading from central: https://repo.maven.apache.org/maven2/org/apache/apache/17/apache-17.pom
Downloaded from central: https://repo.maven.apache.org/maven2/org/apache/apache/17/apache-17.pom (0 B at 0 B/s)
Downloading from central: https://repo.maven.apache.org/maven2/org/apache/maven/shared/maven-shared-utils/3.0.0/maven-shared-utils-3.0.0.pom
Downloaded from central: https://repo.maven.apache.org/maven2/org/apache/maven/shared/maven-shared-utils/3.0.0/maven-shared-utils-3.0.0.pom (0 B at 0 B/s)
Downloading from central: https://repo.maven.apache.org/maven2/org/apache/maven/shared/maven-shared-components/21/maven-shared-components-21.pom
Downloaded from central: https://repo.maven.apache.org/maven2/org/apache/maven/shared/maven-shared-components/21/maven-shared-components-21.pom (0 B at 0 B/s)
Downloading from central: https://repo.maven.apache.org/maven2/org/apache/maven/maven-parent/25/maven-parent-25.pom
Downloaded from central: https://repo.maven.apache.org/maven2/org/apache/maven/maven-parent/25/maven-parent-25.pom (0 B at 0 B/s)
Downloading from central: https://repo.maven.apache.org/maven2/org/apache/apache/15/apache-15.pom
Downloaded from central: https://repo.maven.apache.org/maven2/org/apache/apache/15/apache-15.pom (0 B at 0 B/s)
Downloading from central: https://repo.maven.apache.org/maven2/org/ow2/asm/asm/5.1/asm-5.1.pom
Downloaded from central: https://repo.maven.apache.org/maven2/org/ow2/asm/asm/5.1/asm-5.1.pom (0 B at 0 B/s)
Downloading from central: https://repo.maven.apache.org/maven2/org/ow2/asm/asm-parent/5.1/asm-parent-5.1.pom
Downloaded from central: https://repo.maven.apache.org/maven2/org/ow2/asm/asm-parent/5.1/asm-parent-5.1.pom (0 B at 0 B/s)
Downloading from central: https://repo.maven.apache.org/maven2/org/ow2/asm/asm-commons/5.1/asm-commons-5.1.pom
Downloaded from central: https://repo.maven.apache.org/maven2/org/ow2/asm/asm-commons/5.1/asm-commons-5.1.pom (0 B at 0 B/s)
Downloading from central: https://repo.maven.apache.org/maven2/org/ow2/asm/asm-tree/5.1/asm-tree-5.1.pom
Downloaded from central: https://repo.maven.apache.org/maven2/org/ow2/asm/asm-tree/5.1/asm-tree-5.1.pom (0 B at 0 B/s)
Downloading from central: https://repo.maven.apache.org/maven2/org/jdom/jdom/1.1.3/jdom-1.1.3.pom
Downloaded from central: https://repo.maven.apache.org/maven2/org/jdom/jdom/1.1.3/jdom-1.1.3.pom (0 B at 0 B/s)
Downloading from central: https://repo.maven.apache.org/maven2/org/vafer/jdependency/1.1/jdependency-1.1.pom
Downloaded from central: https://repo.maven.apache.org/maven2/org/vafer/jdependency/1.1/jdependency-1.1.pom (0 B at 0 B/s)
Downloading from central: https://repo.maven.apache.org/maven2/org/ow2/asm/asm/5.0.4/asm-5.0.4.pom
Downloaded from central: https://repo.maven.apache.org/maven2/org/ow2/asm/asm/5.0.4/asm-5.0.4.pom (0 B at 0 B/s)
Downloading from central: https://repo.maven.apache.org/maven2/org/ow2/asm/asm-parent/5.0.4/asm-parent-5.0.4.pom
Downloaded from central: https://repo.maven.apache.org/maven2/org/ow2/asm/asm-parent/5.0.4/asm-parent-5.0.4.pom (0 B at 0 B/s)
Downloading from central: https://repo.maven.apache.org/maven2/org/ow2/asm/asm-analysis/5.0.4/asm-analysis-5.0.4.pom
Downloaded from central: https://repo.maven.apache.org/maven2/org/ow2/asm/asm-analysis/5.0.4/asm-analysis-5.0.4.pom (0 B at 0 B/s)
Downloading from central: https://repo.maven.apache.org/maven2/org/ow2/asm/asm-tree/5.0.4/asm-tree-5.0.4.pom
Downloaded from central: https://repo.maven.apache.org/maven2/org/ow2/asm/asm-tree/5.0.4/asm-tree-5.0.4.pom (0 B at 0 B/s)
Downloading from central: https://repo.maven.apache.org/maven2/org/ow2/asm/asm-commons/5.0.4/asm-commons-5.0.4.pom
Downloaded from central: https://repo.maven.apache.org/maven2/org/ow2/asm/asm-commons/5.0.4/asm-commons-5.0.4.pom (0 B at 0 B/s)
Downloading from central: https://repo.maven.apache.org/maven2/org/ow2/asm/asm-util/5.0.4/asm-util-5.0.4.pom
Downloaded from central: https://repo.maven.apache.org/maven2/org/ow2/asm/asm-util/5.0.4/asm-util-5.0.4.pom (0 B at 0 B/s)
Downloading from central: https://repo.maven.apache.org/maven2/org/apache/maven/shared/maven-artifact-transfer/0.9.0/maven-artifact-transfer-0.9.0.jar
Downloading from central: https://repo.maven.apache.org/maven2/org/ow2/asm/asm/5.1/asm-5.1.jar
Downloading from central: https://repo.maven.apache.org/maven2/org/ow2/asm/asm-commons/5.1/asm-commons-5.1.jar
Downloading from central: https://repo.maven.apache.org/maven2/org/apache/maven/shared/maven-shared-utils/3.0.0/maven-shared-utils-3.0.0.jar
Downloading from central: https://repo.maven.apache.org/maven2/org/apache/maven/shared/maven-common-artifact-filters/3.0.0/maven-common-artifact-filters-3.0.0.jar
Downloaded from central: https://repo.maven.apache.org/maven2/org/apache/maven/shared/maven-artifact-transfer/0.9.0/maven-artifact-transfer-0.9.0.jar (0 B at 0 B/s)
Downloading from central: https://repo.maven.apache.org/maven2/org/ow2/asm/asm-tree/5.1/asm-tree-5.1.jar
Downloaded from central: https://repo.maven.apache.org/maven2/org/ow2/asm/asm-tree/5.1/asm-tree-5.1.jar (0 B at 0 B/s)
Downloading from central: https://repo.maven.apache.org/maven2/org/jdom/jdom/1.1.3/jdom-1.1.3.jar
Downloaded from central: https://repo.maven.apache.org/maven2/org/ow2/asm/asm-commons/5.1/asm-commons-5.1.jar (0 B at 0 B/s)
Downloading from central: https://repo.maven.apache.org/maven2/org/vafer/jdependency/1.1/jdependency-1.1.jar
Downloaded from central: https://repo.maven.apache.org/maven2/org/apache/maven/shared/maven-shared-utils/3.0.0/maven-shared-utils-3.0.0.jar (0 B at 0 B/s)
Downloading from central: https://repo.maven.apache.org/maven2/org/ow2/asm/asm-analysis/5.0.4/asm-analysis-5.0.4.jar
Downloaded from central: https://repo.maven.apache.org/maven2/org/apache/maven/shared/maven-common-artifact-filters/3.0.0/maven-common-artifact-filters-3.0.0.jar (0 B at 0 B/s)
Downloaded from central: https://repo.maven.apache.org/maven2/org/ow2/asm/asm/5.1/asm-5.1.jar (0 B at 0 B/s)
Downloading from central: https://repo.maven.apache.org/maven2/org/ow2/asm/asm-util/5.0.4/asm-util-5.0.4.jar
Downloaded from central: https://repo.maven.apache.org/maven2/org/jdom/jdom/1.1.3/jdom-1.1.3.jar (0 B at 0 B/s)
Downloaded from central: https://repo.maven.apache.org/maven2/org/vafer/jdependency/1.1/jdependency-1.1.jar (0 B at 0 B/s)
Downloaded from central: https://repo.maven.apache.org/maven2/org/ow2/asm/asm-util/5.0.4/asm-util-5.0.4.jar (0 B at 0 B/s)
Downloaded from central: https://repo.maven.apache.org/maven2/org/ow2/asm/asm-analysis/5.0.4/asm-analysis-5.0.4.jar (0 B at 0 B/s)
[INFO] Including net.md-5:bungeecord-proxy:jar:1.12-SNAPSHOT in the shaded jar.
[INFO] Including com.flowpowered:flow-nbt:jar:1.0.0 in the shaded jar.
[INFO] Including io.netty:netty-codec-haproxy:jar:4.1.18.Final in the shaded jar.
[INFO] Including io.netty:netty-codec:jar:4.1.18.Final in the shaded jar.
[INFO] Including io.netty:netty-codec-http:jar:4.1.18.Final in the shaded jar.
[INFO] Including io.netty:netty-handler:jar:4.1.18.Final in the shaded jar.
[INFO] Including io.netty:netty-buffer:jar:4.1.18.Final in the shaded jar.
[INFO] Including io.netty:netty-transport:jar:4.1.18.Final in the shaded jar.
[INFO] Including io.netty:netty-resolver:jar:4.1.18.Final in the shaded jar.
[INFO] Including io.netty:netty-transport-native-epoll:jar:linux-x86_64:4.1.18.Final in the shaded jar.
[INFO] Including io.netty:netty-common:jar:4.1.18.Final in the shaded jar.
[INFO] Including io.netty:netty-transport-native-unix-common:jar:4.1.18.Final in the shaded jar.
[INFO] Including net.md-5:bungeecord-api:jar:1.12-SNAPSHOT in the shaded jar.
[INFO] Including net.md-5:bungeecord-chat:jar:1.12-SNAPSHOT in the shaded jar.
[INFO] Including com.google.code.gson:gson:jar:2.8.0 in the shaded jar.
[INFO] Including net.md-5:bungeecord-config:jar:1.12-SNAPSHOT in the shaded jar.
[INFO] Including org.yaml:snakeyaml:jar:1.19 in the shaded jar.
[INFO] Including net.md-5:bungeecord-event:jar:1.12-SNAPSHOT in the shaded jar.
[INFO] Including net.md-5:bungeecord-log:jar:1.12-SNAPSHOT in the shaded jar.
[INFO] Including jline:jline:jar:2.12.1 in the shaded jar.
[INFO] Including net.md-5:bungeecord-native:jar:1.12-SNAPSHOT in the shaded jar.
[INFO] Including net.md-5:bungeecord-protocol:jar:1.12-SNAPSHOT in the shaded jar.
[INFO] Including net.sf.trove4j:trove4j:jar:3.0.3 in the shaded jar.
[INFO] Including net.md-5:bungeecord-query:jar:1.12-SNAPSHOT in the shaded jar.
[INFO] Including mysql:mysql-connector-java:jar:5.1.44 in the shaded jar.
[INFO] Including net.sf.jopt-simple:jopt-simple:jar:4.9 in the shaded jar.
[INFO] Including com.google.guava:guava:jar:20.0 in the shaded jar.
[INFO] Replacing original artifact with shaded artifact.
[INFO] Replacing /home/jenkins/workspace/Bungeecord 1.7.10 Patch/BungeeCord/bootstrap/target/BungeeCord.jar with /home/jenkins/workspace/Bungeecord 1.7.10 Patch/BungeeCord/bootstrap/target/bungeecord-bootstrap-1.12-SNAPSHOT-shaded.jar
[INFO] Dependency-reduced POM written at: /home/jenkins/workspace/Bungeecord 1.7.10 Patch/BungeeCord/bootstrap/dependency-reduced-pom.xml
[INFO] 
[INFO] --- maven-install-plugin:2.4:install (default-install) @ bungeecord-bootstrap ---
[INFO] Installing /home/jenkins/workspace/Bungeecord 1.7.10 Patch/BungeeCord/bootstrap/target/BungeeCord.jar to /home/jenkins/.m2/repository/net/md-5/bungeecord-bootstrap/1.12-SNAPSHOT/bungeecord-bootstrap-1.12-SNAPSHOT.jar
[INFO] Installing /home/jenkins/workspace/Bungeecord 1.7.10 Patch/BungeeCord/bootstrap/dependency-reduced-pom.xml to /home/jenkins/.m2/repository/net/md-5/bungeecord-bootstrap/1.12-SNAPSHOT/bungeecord-bootstrap-1.12-SNAPSHOT.pom
[INFO] 
[INFO] ---------------------< net.md-5:bungeecord-module >---------------------
[INFO] Building BungeeCord Modules 1.12-SNAPSHOT                        [12/18]
[INFO] --------------------------------[ pom ]---------------------------------
[INFO] 
[INFO] --- maven-clean-plugin:2.5:clean (default-clean) @ bungeecord-module ---
[INFO] 
[INFO] --- scriptus:0.3.1:describe (default) @ bungeecord-module ---
[INFO] Set property "describe" to "git:BungeeCord Modules:1.12-SNAPSHOT:aadfe0b:unknown"
[INFO] 
[INFO] --- animal-sniffer-maven-plugin:1.16:check (default) @ bungeecord-module ---
[INFO] Checking unresolved references to org.codehaus.mojo.signature:java17:1.0
[INFO] 
[INFO] --- maven-install-plugin:2.4:install (default-install) @ bungeecord-module ---
[INFO] Installing /home/jenkins/workspace/Bungeecord 1.7.10 Patch/BungeeCord/module/pom.xml to /home/jenkins/.m2/repository/net/md-5/bungeecord-module/1.12-SNAPSHOT/bungeecord-module-1.12-SNAPSHOT.pom
[INFO] 
[INFO] ----------------< net.md-5:bungeecord-module-cmd-alert >----------------
[INFO] Building cmd_alert 1.12-SNAPSHOT                                 [13/18]
[INFO] --------------------------------[ jar ]---------------------------------
[INFO] 
[INFO] --- maven-clean-plugin:2.5:clean (default-clean) @ bungeecord-module-cmd-alert ---
[INFO] 
[INFO] --- scriptus:0.3.1:describe (default) @ bungeecord-module-cmd-alert ---
[INFO] Set property "describe" to "git:cmd_alert:1.12-SNAPSHOT:aadfe0b:unknown"
[INFO] 
[INFO] --- maven-resources-plugin:2.6:resources (default-resources) @ bungeecord-module-cmd-alert ---
[INFO] Using 'UTF-8' encoding to copy filtered resources.
[INFO] Copying 1 resource
[INFO] 
[INFO] --- maven-compiler-plugin:3.1:compile (default-compile) @ bungeecord-module-cmd-alert ---
[INFO] Changes detected - recompiling the module!
[INFO] Compiling 3 source files to /home/jenkins/workspace/Bungeecord 1.7.10 Patch/BungeeCord/module/cmd-alert/target/classes
[WARNING] /home/jenkins/workspace/Bungeecord 1.7.10 Patch/BungeeCord/module/cmd-alert/src/main/java/net/md_5/bungee/module/cmd/alert/CommandAlert.java: Some input files use or override a deprecated API.
[WARNING] /home/jenkins/workspace/Bungeecord 1.7.10 Patch/BungeeCord/module/cmd-alert/src/main/java/net/md_5/bungee/module/cmd/alert/CommandAlert.java: Recompile with -Xlint:deprecation for details.
[INFO] 
[INFO] --- animal-sniffer-maven-plugin:1.16:check (default) @ bungeecord-module-cmd-alert ---
[INFO] Checking unresolved references to org.codehaus.mojo.signature:java17:1.0
[INFO] 
[INFO] --- maven-resources-plugin:2.6:testResources (default-testResources) @ bungeecord-module-cmd-alert ---
[INFO] Using 'UTF-8' encoding to copy filtered resources.
[INFO] skip non existing resourceDirectory /home/jenkins/workspace/Bungeecord 1.7.10 Patch/BungeeCord/module/cmd-alert/src/test/resources
[INFO] 
[INFO] --- maven-compiler-plugin:3.1:testCompile (default-testCompile) @ bungeecord-module-cmd-alert ---
[INFO] No sources to compile
[INFO] 
[INFO] --- maven-surefire-plugin:2.12.4:test (default-test) @ bungeecord-module-cmd-alert ---
[INFO] No tests to run.
[INFO] 
[INFO] --- maven-jar-plugin:2.4:jar (default-jar) @ bungeecord-module-cmd-alert ---
[INFO] Building jar: /home/jenkins/workspace/Bungeecord 1.7.10 Patch/BungeeCord/module/cmd-alert/target/cmd_alert.jar
[INFO] 
[INFO] --- maven-install-plugin:2.4:install (default-install) @ bungeecord-module-cmd-alert ---
[INFO] Installing /home/jenkins/workspace/Bungeecord 1.7.10 Patch/BungeeCord/module/cmd-alert/target/cmd_alert.jar to /home/jenkins/.m2/repository/net/md-5/bungeecord-module-cmd-alert/1.12-SNAPSHOT/bungeecord-module-cmd-alert-1.12-SNAPSHOT.jar
[INFO] Installing /home/jenkins/workspace/Bungeecord 1.7.10 Patch/BungeeCord/module/cmd-alert/pom.xml to /home/jenkins/.m2/repository/net/md-5/bungeecord-module-cmd-alert/1.12-SNAPSHOT/bungeecord-module-cmd-alert-1.12-SNAPSHOT.pom
[INFO] 
[INFO] ----------------< net.md-5:bungeecord-module-cmd-find >-----------------
[INFO] Building cmd_find 1.12-SNAPSHOT                                  [14/18]
[INFO] --------------------------------[ jar ]---------------------------------
[INFO] 
[INFO] --- maven-clean-plugin:2.5:clean (default-clean) @ bungeecord-module-cmd-find ---
[INFO] 
[INFO] --- scriptus:0.3.1:describe (default) @ bungeecord-module-cmd-find ---
[INFO] Set property "describe" to "git:cmd_find:1.12-SNAPSHOT:aadfe0b:unknown"
[INFO] 
[INFO] --- maven-resources-plugin:2.6:resources (default-resources) @ bungeecord-module-cmd-find ---
[INFO] Using 'UTF-8' encoding to copy filtered resources.
[INFO] Copying 1 resource
[INFO] 
[INFO] --- maven-compiler-plugin:3.1:compile (default-compile) @ bungeecord-module-cmd-find ---
[INFO] Changes detected - recompiling the module!
[INFO] Compiling 2 source files to /home/jenkins/workspace/Bungeecord 1.7.10 Patch/BungeeCord/module/cmd-find/target/classes
[WARNING] /home/jenkins/workspace/Bungeecord 1.7.10 Patch/BungeeCord/module/cmd-find/src/main/java/net/md_5/bungee/module/cmd/find/CommandFind.java: /home/jenkins/workspace/Bungeecord 1.7.10 Patch/BungeeCord/module/cmd-find/src/main/java/net/md_5/bungee/module/cmd/find/CommandFind.java uses or overrides a deprecated API.
[WARNING] /home/jenkins/workspace/Bungeecord 1.7.10 Patch/BungeeCord/module/cmd-find/src/main/java/net/md_5/bungee/module/cmd/find/CommandFind.java: Recompile with -Xlint:deprecation for details.
[INFO] 
[INFO] --- animal-sniffer-maven-plugin:1.16:check (default) @ bungeecord-module-cmd-find ---
[INFO] Checking unresolved references to org.codehaus.mojo.signature:java17:1.0
[INFO] 
[INFO] --- maven-resources-plugin:2.6:testResources (default-testResources) @ bungeecord-module-cmd-find ---
[INFO] Using 'UTF-8' encoding to copy filtered resources.
[INFO] skip non existing resourceDirectory /home/jenkins/workspace/Bungeecord 1.7.10 Patch/BungeeCord/module/cmd-find/src/test/resources
[INFO] 
[INFO] --- maven-compiler-plugin:3.1:testCompile (default-testCompile) @ bungeecord-module-cmd-find ---
[INFO] No sources to compile
[INFO] 
[INFO] --- maven-surefire-plugin:2.12.4:test (default-test) @ bungeecord-module-cmd-find ---
[INFO] No tests to run.
[INFO] 
[INFO] --- maven-jar-plugin:2.4:jar (default-jar) @ bungeecord-module-cmd-find ---
[INFO] Building jar: /home/jenkins/workspace/Bungeecord 1.7.10 Patch/BungeeCord/module/cmd-find/target/cmd_find.jar
[INFO] 
[INFO] --- maven-install-plugin:2.4:install (default-install) @ bungeecord-module-cmd-find ---
[INFO] Installing /home/jenkins/workspace/Bungeecord 1.7.10 Patch/BungeeCord/module/cmd-find/target/cmd_find.jar to /home/jenkins/.m2/repository/net/md-5/bungeecord-module-cmd-find/1.12-SNAPSHOT/bungeecord-module-cmd-find-1.12-SNAPSHOT.jar
[INFO] Installing /home/jenkins/workspace/Bungeecord 1.7.10 Patch/BungeeCord/module/cmd-find/pom.xml to /home/jenkins/.m2/repository/net/md-5/bungeecord-module-cmd-find/1.12-SNAPSHOT/bungeecord-module-cmd-find-1.12-SNAPSHOT.pom
[INFO] 
[INFO] ----------------< net.md-5:bungeecord-module-cmd-list >-----------------
[INFO] Building cmd_list 1.12-SNAPSHOT                                  [15/18]
[INFO] --------------------------------[ jar ]---------------------------------
[INFO] 
[INFO] --- maven-clean-plugin:2.5:clean (default-clean) @ bungeecord-module-cmd-list ---
[INFO] 
[INFO] --- scriptus:0.3.1:describe (default) @ bungeecord-module-cmd-list ---
[INFO] Set property "describe" to "git:cmd_list:1.12-SNAPSHOT:aadfe0b:unknown"
[INFO] 
[INFO] --- maven-resources-plugin:2.6:resources (default-resources) @ bungeecord-module-cmd-list ---
[INFO] Using 'UTF-8' encoding to copy filtered resources.
[INFO] Copying 1 resource
[INFO] 
[INFO] --- maven-compiler-plugin:3.1:compile (default-compile) @ bungeecord-module-cmd-list ---
[INFO] Changes detected - recompiling the module!
[INFO] Compiling 2 source files to /home/jenkins/workspace/Bungeecord 1.7.10 Patch/BungeeCord/module/cmd-list/target/classes
[WARNING] /home/jenkins/workspace/Bungeecord 1.7.10 Patch/BungeeCord/module/cmd-list/src/main/java/net/md_5/bungee/module/cmd/list/CommandList.java: /home/jenkins/workspace/Bungeecord 1.7.10 Patch/BungeeCord/module/cmd-list/src/main/java/net/md_5/bungee/module/cmd/list/CommandList.java uses or overrides a deprecated API.
[WARNING] /home/jenkins/workspace/Bungeecord 1.7.10 Patch/BungeeCord/module/cmd-list/src/main/java/net/md_5/bungee/module/cmd/list/CommandList.java: Recompile with -Xlint:deprecation for details.
[INFO] 
[INFO] --- animal-sniffer-maven-plugin:1.16:check (default) @ bungeecord-module-cmd-list ---
[INFO] Checking unresolved references to org.codehaus.mojo.signature:java17:1.0
[INFO] 
[INFO] --- maven-resources-plugin:2.6:testResources (default-testResources) @ bungeecord-module-cmd-list ---
[INFO] Using 'UTF-8' encoding to copy filtered resources.
[INFO] skip non existing resourceDirectory /home/jenkins/workspace/Bungeecord 1.7.10 Patch/BungeeCord/module/cmd-list/src/test/resources
[INFO] 
[INFO] --- maven-compiler-plugin:3.1:testCompile (default-testCompile) @ bungeecord-module-cmd-list ---
[INFO] No sources to compile
[INFO] 
[INFO] --- maven-surefire-plugin:2.12.4:test (default-test) @ bungeecord-module-cmd-list ---
[INFO] No tests to run.
[INFO] 
[INFO] --- maven-jar-plugin:2.4:jar (default-jar) @ bungeecord-module-cmd-list ---
[INFO] Building jar: /home/jenkins/workspace/Bungeecord 1.7.10 Patch/BungeeCord/module/cmd-list/target/cmd_list.jar
[INFO] 
[INFO] --- maven-install-plugin:2.4:install (default-install) @ bungeecord-module-cmd-list ---
[INFO] Installing /home/jenkins/workspace/Bungeecord 1.7.10 Patch/BungeeCord/module/cmd-list/target/cmd_list.jar to /home/jenkins/.m2/repository/net/md-5/bungeecord-module-cmd-list/1.12-SNAPSHOT/bungeecord-module-cmd-list-1.12-SNAPSHOT.jar
[INFO] Installing /home/jenkins/workspace/Bungeecord 1.7.10 Patch/BungeeCord/module/cmd-list/pom.xml to /home/jenkins/.m2/repository/net/md-5/bungeecord-module-cmd-list/1.12-SNAPSHOT/bungeecord-module-cmd-list-1.12-SNAPSHOT.pom
[INFO] 
[INFO] ----------------< net.md-5:bungeecord-module-cmd-send >-----------------
[INFO] Building cmd_send 1.12-SNAPSHOT                                  [16/18]
[INFO] --------------------------------[ jar ]---------------------------------
[INFO] 
[INFO] --- maven-clean-plugin:2.5:clean (default-clean) @ bungeecord-module-cmd-send ---
[INFO] 
[INFO] --- scriptus:0.3.1:describe (default) @ bungeecord-module-cmd-send ---
[INFO] Set property "describe" to "git:cmd_send:1.12-SNAPSHOT:aadfe0b:unknown"
[INFO] 
[INFO] --- maven-resources-plugin:2.6:resources (default-resources) @ bungeecord-module-cmd-send ---
[INFO] Using 'UTF-8' encoding to copy filtered resources.
[INFO] Copying 1 resource
[INFO] 
[INFO] --- maven-compiler-plugin:3.1:compile (default-compile) @ bungeecord-module-cmd-send ---
[INFO] Changes detected - recompiling the module!
[INFO] Compiling 2 source files to /home/jenkins/workspace/Bungeecord 1.7.10 Patch/BungeeCord/module/cmd-send/target/classes
[WARNING] /home/jenkins/workspace/Bungeecord 1.7.10 Patch/BungeeCord/module/cmd-send/src/main/java/net/md_5/bungee/module/cmd/send/CommandSend.java: /home/jenkins/workspace/Bungeecord 1.7.10 Patch/BungeeCord/module/cmd-send/src/main/java/net/md_5/bungee/module/cmd/send/CommandSend.java uses or overrides a deprecated API.
[WARNING] /home/jenkins/workspace/Bungeecord 1.7.10 Patch/BungeeCord/module/cmd-send/src/main/java/net/md_5/bungee/module/cmd/send/CommandSend.java: Recompile with -Xlint:deprecation for details.
[INFO] 
[INFO] --- animal-sniffer-maven-plugin:1.16:check (default) @ bungeecord-module-cmd-send ---
[INFO] Checking unresolved references to org.codehaus.mojo.signature:java17:1.0
[INFO] 
[INFO] --- maven-resources-plugin:2.6:testResources (default-testResources) @ bungeecord-module-cmd-send ---
[INFO] Using 'UTF-8' encoding to copy filtered resources.
[INFO] skip non existing resourceDirectory /home/jenkins/workspace/Bungeecord 1.7.10 Patch/BungeeCord/module/cmd-send/src/test/resources
[INFO] 
[INFO] --- maven-compiler-plugin:3.1:testCompile (default-testCompile) @ bungeecord-module-cmd-send ---
[INFO] No sources to compile
[INFO] 
[INFO] --- maven-surefire-plugin:2.12.4:test (default-test) @ bungeecord-module-cmd-send ---
[INFO] No tests to run.
[INFO] 
[INFO] --- maven-jar-plugin:2.4:jar (default-jar) @ bungeecord-module-cmd-send ---
[INFO] Building jar: /home/jenkins/workspace/Bungeecord 1.7.10 Patch/BungeeCord/module/cmd-send/target/cmd_send.jar
[INFO] 
[INFO] --- maven-install-plugin:2.4:install (default-install) @ bungeecord-module-cmd-send ---
[INFO] Installing /home/jenkins/workspace/Bungeecord 1.7.10 Patch/BungeeCord/module/cmd-send/target/cmd_send.jar to /home/jenkins/.m2/repository/net/md-5/bungeecord-module-cmd-send/1.12-SNAPSHOT/bungeecord-module-cmd-send-1.12-SNAPSHOT.jar
[INFO] Installing /home/jenkins/workspace/Bungeecord 1.7.10 Patch/BungeeCord/module/cmd-send/pom.xml to /home/jenkins/.m2/repository/net/md-5/bungeecord-module-cmd-send/1.12-SNAPSHOT/bungeecord-module-cmd-send-1.12-SNAPSHOT.pom
[INFO] 
[INFO] ---------------< net.md-5:bungeecord-module-cmd-server >----------------
[INFO] Building cmd_server 1.12-SNAPSHOT                                [17/18]
[INFO] --------------------------------[ jar ]---------------------------------
[INFO] 
[INFO] --- maven-clean-plugin:2.5:clean (default-clean) @ bungeecord-module-cmd-server ---
[INFO] 
[INFO] --- scriptus:0.3.1:describe (default) @ bungeecord-module-cmd-server ---
[INFO] Set property "describe" to "git:cmd_server:1.12-SNAPSHOT:aadfe0b:unknown"
[INFO] 
[INFO] --- maven-resources-plugin:2.6:resources (default-resources) @ bungeecord-module-cmd-server ---
[INFO] Using 'UTF-8' encoding to copy filtered resources.
[INFO] Copying 1 resource
[INFO] 
[INFO] --- maven-compiler-plugin:3.1:compile (default-compile) @ bungeecord-module-cmd-server ---
[INFO] Changes detected - recompiling the module!
[INFO] Compiling 2 source files to /home/jenkins/workspace/Bungeecord 1.7.10 Patch/BungeeCord/module/cmd-server/target/classes
[WARNING] /home/jenkins/workspace/Bungeecord 1.7.10 Patch/BungeeCord/module/cmd-server/src/main/java/net/md_5/bungee/module/cmd/server/CommandServer.java: /home/jenkins/workspace/Bungeecord 1.7.10 Patch/BungeeCord/module/cmd-server/src/main/java/net/md_5/bungee/module/cmd/server/CommandServer.java uses or overrides a deprecated API.
[WARNING] /home/jenkins/workspace/Bungeecord 1.7.10 Patch/BungeeCord/module/cmd-server/src/main/java/net/md_5/bungee/module/cmd/server/CommandServer.java: Recompile with -Xlint:deprecation for details.
[WARNING] /home/jenkins/workspace/Bungeecord 1.7.10 Patch/BungeeCord/module/cmd-server/src/main/java/net/md_5/bungee/module/cmd/server/CommandServer.java: /home/jenkins/workspace/Bungeecord 1.7.10 Patch/BungeeCord/module/cmd-server/src/main/java/net/md_5/bungee/module/cmd/server/CommandServer.java uses unchecked or unsafe operations.
[WARNING] /home/jenkins/workspace/Bungeecord 1.7.10 Patch/BungeeCord/module/cmd-server/src/main/java/net/md_5/bungee/module/cmd/server/CommandServer.java: Recompile with -Xlint:unchecked for details.
[INFO] 
[INFO] --- animal-sniffer-maven-plugin:1.16:check (default) @ bungeecord-module-cmd-server ---
[INFO] Checking unresolved references to org.codehaus.mojo.signature:java17:1.0
[INFO] 
[INFO] --- maven-resources-plugin:2.6:testResources (default-testResources) @ bungeecord-module-cmd-server ---
[INFO] Using 'UTF-8' encoding to copy filtered resources.
[INFO] skip non existing resourceDirectory /home/jenkins/workspace/Bungeecord 1.7.10 Patch/BungeeCord/module/cmd-server/src/test/resources
[INFO] 
[INFO] --- maven-compiler-plugin:3.1:testCompile (default-testCompile) @ bungeecord-module-cmd-server ---
[INFO] No sources to compile
[INFO] 
[INFO] --- maven-surefire-plugin:2.12.4:test (default-test) @ bungeecord-module-cmd-server ---
[INFO] No tests to run.
[INFO] 
[INFO] --- maven-jar-plugin:2.4:jar (default-jar) @ bungeecord-module-cmd-server ---
[INFO] Building jar: /home/jenkins/workspace/Bungeecord 1.7.10 Patch/BungeeCord/module/cmd-server/target/cmd_server.jar
[INFO] 
[INFO] --- maven-install-plugin:2.4:install (default-install) @ bungeecord-module-cmd-server ---
[INFO] Installing /home/jenkins/workspace/Bungeecord 1.7.10 Patch/BungeeCord/module/cmd-server/target/cmd_server.jar to /home/jenkins/.m2/repository/net/md-5/bungeecord-module-cmd-server/1.12-SNAPSHOT/bungeecord-module-cmd-server-1.12-SNAPSHOT.jar
[INFO] Installing /home/jenkins/workspace/Bungeecord 1.7.10 Patch/BungeeCord/module/cmd-server/pom.xml to /home/jenkins/.m2/repository/net/md-5/bungeecord-module-cmd-server/1.12-SNAPSHOT/bungeecord-module-cmd-server-1.12-SNAPSHOT.pom
[INFO] 
[INFO] -------------< net.md-5:bungeecord-module-reconnect-yaml >--------------
[INFO] Building reconnect_yaml 1.12-SNAPSHOT                            [18/18]
[INFO] --------------------------------[ jar ]---------------------------------
[INFO] 
[INFO] --- maven-clean-plugin:2.5:clean (default-clean) @ bungeecord-module-reconnect-yaml ---
[INFO] 
[INFO] --- scriptus:0.3.1:describe (default) @ bungeecord-module-reconnect-yaml ---
[INFO] Set property "describe" to "git:reconnect_yaml:1.12-SNAPSHOT:aadfe0b:unknown"
[INFO] 
[INFO] --- maven-resources-plugin:2.6:resources (default-resources) @ bungeecord-module-reconnect-yaml ---
[INFO] Using 'UTF-8' encoding to copy filtered resources.
[INFO] Copying 1 resource
[INFO] 
[INFO] --- maven-compiler-plugin:3.1:compile (default-compile) @ bungeecord-module-reconnect-yaml ---
[INFO] Changes detected - recompiling the module!
[INFO] Compiling 2 source files to /home/jenkins/workspace/Bungeecord 1.7.10 Patch/BungeeCord/module/reconnect-yaml/target/classes
[INFO] 
[INFO] --- animal-sniffer-maven-plugin:1.16:check (default) @ bungeecord-module-reconnect-yaml ---
[INFO] Checking unresolved references to org.codehaus.mojo.signature:java17:1.0
[INFO] 
[INFO] --- maven-resources-plugin:2.6:testResources (default-testResources) @ bungeecord-module-reconnect-yaml ---
[INFO] Using 'UTF-8' encoding to copy filtered resources.
[INFO] skip non existing resourceDirectory /home/jenkins/workspace/Bungeecord 1.7.10 Patch/BungeeCord/module/reconnect-yaml/src/test/resources
[INFO] 
[INFO] --- maven-compiler-plugin:3.1:testCompile (default-testCompile) @ bungeecord-module-reconnect-yaml ---
[INFO] No sources to compile
[INFO] 
[INFO] --- maven-surefire-plugin:2.12.4:test (default-test) @ bungeecord-module-reconnect-yaml ---
[INFO] No tests to run.
[INFO] 
[INFO] --- maven-jar-plugin:2.4:jar (default-jar) @ bungeecord-module-reconnect-yaml ---
[INFO] Building jar: /home/jenkins/workspace/Bungeecord 1.7.10 Patch/BungeeCord/module/reconnect-yaml/target/reconnect_yaml.jar
[INFO] 
[INFO] --- maven-install-plugin:2.4:install (default-install) @ bungeecord-module-reconnect-yaml ---
[INFO] Installing /home/jenkins/workspace/Bungeecord 1.7.10 Patch/BungeeCord/module/reconnect-yaml/target/reconnect_yaml.jar to /home/jenkins/.m2/repository/net/md-5/bungeecord-module-reconnect-yaml/1.12-SNAPSHOT/bungeecord-module-reconnect-yaml-1.12-SNAPSHOT.jar
[INFO] Installing /home/jenkins/workspace/Bungeecord 1.7.10 Patch/BungeeCord/module/reconnect-yaml/pom.xml to /home/jenkins/.m2/repository/net/md-5/bungeecord-module-reconnect-yaml/1.12-SNAPSHOT/bungeecord-module-reconnect-yaml-1.12-SNAPSHOT.pom
[INFO] ------------------------------------------------------------------------
[INFO] Reactor Summary for BungeeCord-Parent 1.12-SNAPSHOT:
[INFO] 
[INFO] BungeeCord-Parent .................................. SUCCESS [  7.330 s]
[INFO] BungeeCord-Chat .................................... SUCCESS [  4.017 s]
[INFO] BungeeCord-Config .................................. SUCCESS [  1.463 s]
[INFO] BungeeCord-Event ................................... SUCCESS [  1.061 s]
[INFO] BungeeCord-Protocol ................................ SUCCESS [  2.763 s]
[INFO] BungeeCord-API ..................................... SUCCESS [  2.023 s]
[INFO] BungeeCord-Log ..................................... SUCCESS [  0.769 s]
[INFO] BungeeCord-Native .................................. SUCCESS [ 10.967 s]
[INFO] BungeeCord-Query ................................... SUCCESS [  0.814 s]
[INFO] BungeeCord-Proxy ................................... SUCCESS [  5.786 s]
[INFO] BungeeCord-Bootstrap ............................... SUCCESS [  4.789 s]
[INFO] BungeeCord Modules ................................. SUCCESS [  0.572 s]
[INFO] cmd_alert .......................................... SUCCESS [  0.625 s]
[INFO] cmd_find ........................................... SUCCESS [  0.557 s]
[INFO] cmd_list ........................................... SUCCESS [  0.706 s]
[INFO] cmd_send ........................................... SUCCESS [  0.952 s]
[INFO] cmd_server ......................................... SUCCESS [  0.583 s]
[INFO] reconnect_yaml ..................................... SUCCESS [  0.579 s]
[INFO] ------------------------------------------------------------------------
[INFO] BUILD SUCCESS
[INFO] ------------------------------------------------------------------------
[INFO] Total time:  46.616 s
[INFO] Finished at: 2018-12-21T14:09:11-06:00
[INFO] ------------------------------------------------------------------------
FATAL: Remote call on Builder failed
Also:   hudson.remoting.Channel$CallSiteStackTrace: Remote call to Builder
		at hudson.remoting.Channel.attachCallSiteStackTrace(Channel.java:1741)
		at hudson.remoting.UserRequest$ExceptionResponse.retrieve(UserRequest.java:357)
		at hudson.remoting.Channel.call(Channel.java:955)
		at hudson.Launcher$RemoteLauncher.kill(Launcher.java:1085)
		at hudson.model.AbstractBuild$AbstractBuildExecution.run(AbstractBuild.java:510)
		at hudson.model.Run.execute(Run.java:1810)
		at hudson.model.FreeStyleBuild.run(FreeStyleBuild.java:43)
		at hudson.model.ResourceController.execute(ResourceController.java:97)
		at hudson.model.Executor.run(Executor.java:429)
java.lang.NoClassDefFoundError: Could not initialize class hudson.slaves.SlaveComputer
	at hudson.util.ProcessTree.get(ProcessTree.java:411)
	at hudson.Launcher$RemoteLauncher$KillTask.call(Launcher.java:1097)
	at hudson.Launcher$RemoteLauncher$KillTask.call(Launcher.java:1088)
	at hudson.remoting.UserRequest.perform(UserRequest.java:212)
	at hudson.remoting.UserRequest.perform(UserRequest.java:54)
	at hudson.remoting.Request$2.run(Request.java:369)
	at hudson.remoting.InterceptingExecutorService$1.call(InterceptingExecutorService.java:72)
	at java.util.concurrent.FutureTask.run(Unknown Source)
	at java.util.concurrent.ThreadPoolExecutor.runWorker(Unknown Source)
	at java.util.concurrent.ThreadPoolExecutor$Worker.run(Unknown Source)
	at java.lang.Thread.run(Unknown Source)
Caused: java.io.IOException: Remote call on Builder failed
	at hudson.remoting.Channel.call(Channel.java:961)
	at hudson.Launcher$RemoteLauncher.kill(Launcher.java:1085)
	at hudson.model.AbstractBuild$AbstractBuildExecution.run(AbstractBuild.java:510)
	at hudson.model.Run.execute(Run.java:1810)
	at hudson.model.FreeStyleBuild.run(FreeStyleBuild.java:43)
	at hudson.model.ResourceController.execute(ResourceController.java:97)
	at hudson.model.Executor.run(Executor.java:429)
Archiving artifacts
[WS-CLEANUP] Deleting project workspace...[WS-CLEANUP] Skipped based on build state FAILURE
Finished: FAILURE